{"text_format":"1","workbook":"xlsx","n_sheets":2,"sheets":["Worksheet","SYSTEM FORMULAE"],"not_rendered":{"charts":0,"images":0,"macros":1,"external_links":0,"defined_names":3,"comments":0,"pivot_tables":0},"unopened":[],"bounds":{"document_bytes":16777216,"sheet_cells":100000,"rows_first":2000,"rows_last":500,"rows_between":2000,"halvings":0,"cell_chars":16384,"cell_head_chars":4096},"cells_cut":0,"cells_raw":0,"read":"whole","date_system":"1900"}

{"sheet":"Worksheet","index":0,"n_rows":22,"n_cols":25,"rows_kept":22,"cut":false,"hidden":false,"merged":[[2,0,2,1],[0,2,0,20]]}
[null,null,"Use the symbol   <,   >   or   =   in each question"]
[]
["Variables",null,1,540,">",537,null,20,250,"=",250,null,39,228,">",195,null,58,715,"<",724]
["SHOW ANSWERS?",false,2,275,">",268,null,21,908,">",906,null,40,240,"<",263,null,59,177,">",175,null,null,null,{"$f":"NOT(B4)","v":true}]
["Number of questions (minimum 20, maximum 80)",76,3,606,">",583,null,22,364,">",274,null,41,416,">",415,null,60,276,"=",276]
["Maximum number of digits    (min 3, max 5)",3,4,459,"<",475,null,23,553,"<",569,null,42,193,"<",280,null,61,823,"=",823]
[null,null,5,825,">",738,null,24,56,"<",145,null,43,349,"=",349,null,62,968,"<",975]
[null,null,6,187,">",112,null,25,768,">",766,null,44,476,"<",480,null,63,225,">",221]
[null,null,7,742,">",686,null,26,289,"=",289,null,45,267,"<",273,null,64,162,"<",184]
[null,null,8,931,">",888,null,27,92,"<",101,null,46,918,"<",923,null,65,510,"<",513]
{"$rows_left_out":13}
{"sheet":"SYSTEM FORMULAE","index":1,"n_rows":20,"n_cols":19,"rows_kept":20,"cut":false,"hidden":false,"merged":[]}
[{"$f":"IF(ROW()<=Worksheet!$B$5/4,ROW(),\"\")","v":1},{"$f":"RANDBETWEEN(IF(Worksheet!$B$6<=3,1,101),10^Worksheet!$B$6-1)","v":341},{"$f":"IF(B1=D1,\"=\",IF(B1<D1,\"<\",\">\"))","v":"<"},{"$f":"IF(Worksheet!$B$6>=4,CHOOSE(RANDBETWEEN(1,5),B1+RANDBETWEEN(1,100),B1-RANDBETWEEN(1,100),B1,B1+RANDBETWEEN(101,1000),ABS(B1-RANDBETWEEN(101,1000))),IF(Worksheet!$B$6=1,RANDBETWEEN(0,9),IF(Worksheet!$B$6=2,RANDBETWEEN(1,99),CHOOSE(RANDBETWEEN(1,5),B1+RANDBETWEEN(1,10),ABS(B1-RANDBETWEEN(1,10)),B1,B1+RANDBETWEEN(1,100),ABS(B1-RANDBETWEEN(1,100))))))","v":349},null,{"$f":"MAX(A1:A21)+1","v":20},{"$f":"RANDBETWEEN(IF(Worksheet!$B$6<=3,1,101),10^Worksheet!$B$6-1)","v":838},{"$f":"IF(G1=I1,\"=\",IF(G1<I1,\"<\",\">\"))","v":"<"},{"$f":"IF(Worksheet!$B$6>=4,CHOOSE(RANDBETWEEN(1,5),G1+RANDBETWEEN(1,100),G1-RANDBETWEEN(1,100),G1,G1+RANDBETWEEN(101,1000),ABS(G1-RANDBETWEEN(101,1000))),IF(Worksheet!$B$6=1,RANDBETWEEN(0,9),IF(Worksheet!$B$6=2,RANDBETWEEN(1,99),CHOOSE(RANDBETWEEN(1,5),G1+RANDBETWEEN(1,10),ABS(G1-RANDBETWEEN(1,10)),G1,G1+RANDBETWEEN(1,100),ABS(G1-RANDBETWEEN(1,100))))))","v":860},null,{"$f":"MAX(F1:F21)+1","v":39},{"$f":"RANDBETWEEN(IF(Worksheet!$B$6<=3,1,101),10^Worksheet!$B$6-1)","v":827},{"$f":"IF(L1=N1,\"=\",IF(L1<N1,\"<\",\">\"))","v":"<"},{"$f":"IF(Worksheet!$B$6>=4,CHOOSE(RANDBETWEEN(1,5),L1+RANDBETWEEN(1,100),L1-RANDBETWEEN(1,100),L1,L1+RANDBETWEEN(101,1000),ABS(L1-RANDBETWEEN(101,1000))),IF(Worksheet!$B$6=1,RANDBETWEEN(0,9),IF(Worksheet!$B$6=2,RANDBETWEEN(1,99),CHOOSE(RANDBETWEEN(1,5),L1+RANDBETWEEN(1,10),ABS(L1-RANDBETWEEN(1,10)),L1,L1+RANDBETWEEN(1,100),ABS(L1-RANDBETWEEN(1,100))))))","v":832},null,{"$f":"MAX(K1:K21)+1","v":58},{"$f":"RANDBETWEEN(IF(Worksheet!$B$6<=3,1,101),10^Worksheet!$B$6-1)","v":643},{"$f":"IF(Q1=S1,\"=\",IF(Q1<S1,\"<\",\">\"))","v":"<"},{"$f":"IF(Worksheet!$B$6>=4,CHOOSE(RANDBETWEEN(1,5),Q1+RANDBETWEEN(1,100),Q1-RANDBETWEEN(1,100),Q1,Q1+RANDBETWEEN(101,1000),ABS(Q1-RANDBETWEEN(101,1000))),IF(Worksheet!$B$6=1,RANDBETWEEN(0,9),IF(Worksheet!$B$6=2,RANDBETWEEN(1,99),CHOOSE(RANDBETWEEN(1,5),Q1+RANDBETWEEN(1,10),ABS(Q1-RANDBETWEEN(1,10)),Q1,Q1+RANDBETWEEN(1,100),ABS(Q1-RANDBETWEEN(1,100))))))","v":652}]
[{"$f":"IF(ROW()<=Worksheet!$B$5/4,ROW(),\"\")","v":2},{"$f":"RANDBETWEEN(IF(Worksheet!$B$6<=3,1,101),10^Worksheet!$B$6-1)","v":888},{"$f":"IF(B2=D2,\"=\",IF(B2<D2,\"<\",\">\"))","v":"<"},{"$f":"IF(Worksheet!$B$6>=4,CHOOSE(RANDBETWEEN(1,5),B2+RANDBETWEEN(1,100),B2-RANDBETWEEN(1,100),B2,B2+RANDBETWEEN(101,1000),ABS(B2-RANDBETWEEN(101,1000))),IF(Worksheet!$B$6=1,RANDBETWEEN(0,9),IF(Worksheet!$B$6=2,RANDBETWEEN(1,99),CHOOSE(RANDBETWEEN(1,5),B2+RANDBETWEEN(1,10),ABS(B2-RANDBETWEEN(1,10)),B2,B2+RANDBETWEEN(1,100),ABS(B2-RANDBETWEEN(1,100))))))","v":927},null,{"$f":"IF(ROW()<=Worksheet!$B$5/4,F1+1,\"\")","v":21},{"$f":"RANDBETWEEN(IF(Worksheet!$B$6<=3,1,101),10^Worksheet!$B$6-1)","v":198},{"$f":"IF(G2=I2,\"=\",IF(G2<I2,\"<\",\">\"))","v":">"},{"$f":"IF(Worksheet!$B$6>=4,CHOOSE(RANDBETWEEN(1,5),G2+RANDBETWEEN(1,100),G2-RANDBETWEEN(1,100),G2,G2+RANDBETWEEN(101,1000),ABS(G2-RANDBETWEEN(101,1000))),IF(Worksheet!$B$6=1,RANDBETWEEN(0,9),IF(Worksheet!$B$6=2,RANDBETWEEN(1,99),CHOOSE(RANDBETWEEN(1,5),G2+RANDBETWEEN(1,10),ABS(G2-RANDBETWEEN(1,10)),G2,G2+RANDBETWEEN(1,100),ABS(G2-RANDBETWEEN(1,100))))))","v":191},null,{"$f":"IF(ROW()<=Worksheet!$B$5/4,K1+1,\"\")","v":40},{"$f":"RANDBETWEEN(IF(Worksheet!$B$6<=3,1,101),10^Worksheet!$B$6-1)","v":695},{"$f":"IF(L2=N2,\"=\",IF(L2<N2,\"<\",\">\"))","v":"<"},{"$f":"IF(Worksheet!$B$6>=4,CHOOSE(RANDBETWEEN(1,5),L2+RANDBETWEEN(1,100),L2-RANDBETWEEN(1,100),L2,L2+RANDBETWEEN(101,1000),ABS(L2-RANDBETWEEN(101,1000))),IF(Worksheet!$B$6=1,RANDBETWEEN(0,9),IF(Worksheet!$B$6=2,RANDBETWEEN(1,99),CHOOSE(RANDBETWEEN(1,5),L2+RANDBETWEEN(1,10),ABS(L2-RANDBETWEEN(1,10)),L2,L2+RANDBETWEEN(1,100),ABS(L2-RANDBETWEEN(1,100))))))","v":698},null,{"$f":"IF(ROW()<=Worksheet!$B$5/4,P1+1,\"\")","v":59},{"$f":"RANDBETWEEN(IF(Worksheet!$B$6<=3,1,101),10^Worksheet!$B$6-1)","v":557},{"$f":"IF(Q2=S2,\"=\",IF(Q2<S2,\"<\",\">\"))","v":"<"},{"$f":"IF(Worksheet!$B$6>=4,CHOOSE(RANDBETWEEN(1,5),Q2+RANDBETWEEN(1,100),Q2-RANDBETWEEN(1,100),Q2,Q2+RANDBETWEEN(101,1000),ABS(Q2-RANDBETWEEN(101,1000))),IF(Worksheet!$B$6=1,RANDBETWEEN(0,9),IF(Worksheet!$B$6=2,RANDBETWEEN(1,99),CHOOSE(RANDBETWEEN(1,5),Q2+RANDBETWEEN(1,10),ABS(Q2-RANDBETWEEN(1,10)),Q2,Q2+RANDBETWEEN(1,100),ABS(Q2-RANDBETWEEN(1,100))))))","v":641}]
[{"$f":"IF(ROW()<=Worksheet!$B$5/4,ROW(),\"\")","v":3},{"$f":"RANDBETWEEN(IF(Worksheet!$B$6<=3,1,101),10^Worksheet!$B$6-1)","v":793},"=",{"$f":"IF(Worksheet!$B$6>=4,CHOOSE(RANDBETWEEN(1,5),B3+RANDBETWEEN(1,100),B3-RANDBETWEEN(1,100),B3,B3+RANDBETWEEN(101,1000),ABS(B3-RANDBETWEEN(101,1000))),IF(Worksheet!$B$6=1,RANDBETWEEN(0,9),IF(Worksheet!$B$6=2,RANDBETWEEN(1,99),CHOOSE(RANDBETWEEN(1,5),B3+RANDBETWEEN(1,10),ABS(B3-RANDBETWEEN(1,10)),B3,B3+RANDBETWEEN(1,100),ABS(B3-RANDBETWEEN(1,100))))))","v":793},null,{"$f":"IF(ROW()<=Worksheet!$B$5/4,F2+1,\"\")","v":22},{"$f":"RANDBETWEEN(IF(Worksheet!$B$6<=3,1,101),10^Worksheet!$B$6-1)","v":679},"<",{"$f":"IF(Worksheet!$B$6>=4,CHOOSE(RANDBETWEEN(1,5),G3+RANDBETWEEN(1,100),G3-RANDBETWEEN(1,100),G3,G3+RANDBETWEEN(101,1000),ABS(G3-RANDBETWEEN(101,1000))),IF(Worksheet!$B$6=1,RANDBETWEEN(0,9),IF(Worksheet!$B$6=2,RANDBETWEEN(1,99),CHOOSE(RANDBETWEEN(1,5),G3+RANDBETWEEN(1,10),ABS(G3-RANDBETWEEN(1,10)),G3,G3+RANDBETWEEN(1,100),ABS(G3-RANDBETWEEN(1,100))))))","v":684},null,{"$f":"IF(ROW()<=Worksheet!$B$5/4,K2+1,\"\")","v":41},{"$f":"RANDBETWEEN(IF(Worksheet!$B$6<=3,1,101),10^Worksheet!$B$6-1)","v":683},"<",{"$f":"IF(Worksheet!$B$6>=4,CHOOSE(RANDBETWEEN(1,5),L3+RANDBETWEEN(1,100),L3-RANDBETWEEN(1,100),L3,L3+RANDBETWEEN(101,1000),ABS(L3-RANDBETWEEN(101,1000))),IF(Worksheet!$B$6=1,RANDBETWEEN(0,9),IF(Worksheet!$B$6=2,RANDBETWEEN(1,99),CHOOSE(RANDBETWEEN(1,5),L3+RANDBETWEEN(1,10),ABS(L3-RANDBETWEEN(1,10)),L3,L3+RANDBETWEEN(1,100),ABS(L3-RANDBETWEEN(1,100))))))","v":687},null,{"$f":"IF(ROW()<=Worksheet!$B$5/4,P2+1,\"\")","v":60},{"$f":"RANDBETWEEN(IF(Worksheet!$B$6<=3,1,101),10^Worksheet!$B$6-1)","v":542},"<",{"$f":"IF(Worksheet!$B$6>=4,CHOOSE(RANDBETWEEN(1,5),Q3+RANDBETWEEN(1,100),Q3-RANDBETWEEN(1,100),Q3,Q3+RANDBETWEEN(101,1000),ABS(Q3-RANDBETWEEN(101,1000))),IF(Worksheet!$B$6=1,RANDBETWEEN(0,9),IF(Worksheet!$B$6=2,RANDBETWEEN(1,99),CHOOSE(RANDBETWEEN(1,5),Q3+RANDBETWEEN(1,10),ABS(Q3-RANDBETWEEN(1,10)),Q3,Q3+RANDBETWEEN(1,100),ABS(Q3-RANDBETWEEN(1,100))))))","v":545}]
[{"$f":"IF(ROW()<=Worksheet!$B$5/4,ROW(),\"\")","v":4},{"$f":"RANDBETWEEN(IF(Worksheet!$B$6<=3,1,101),10^Worksheet!$B$6-1)","v":360},">",{"$f":"IF(Worksheet!$B$6>=4,CHOOSE(RANDBETWEEN(1,5),B4+RANDBETWEEN(1,100),B4-RANDBETWEEN(1,100),B4,B4+RANDBETWEEN(101,1000),ABS(B4-RANDBETWEEN(101,1000))),IF(Worksheet!$B$6=1,RANDBETWEEN(0,9),IF(Worksheet!$B$6=2,RANDBETWEEN(1,99),CHOOSE(RANDBETWEEN(1,5),B4+RANDBETWEEN(1,10),ABS(B4-RANDBETWEEN(1,10)),B4,B4+RANDBETWEEN(1,100),ABS(B4-RANDBETWEEN(1,100))))))","v":353},null,{"$f":"IF(ROW()<=Worksheet!$B$5/4,F3+1,\"\")","v":23},{"$f":"RANDBETWEEN(IF(Worksheet!$B$6<=3,1,101),10^Worksheet!$B$6-1)","v":285},"<",{"$f":"IF(Worksheet!$B$6>=4,CHOOSE(RANDBETWEEN(1,5),G4+RANDBETWEEN(1,100),G4-RANDBETWEEN(1,100),G4,G4+RANDBETWEEN(101,1000),ABS(G4-RANDBETWEEN(101,1000))),IF(Worksheet!$B$6=1,RANDBETWEEN(0,9),IF(Worksheet!$B$6=2,RANDBETWEEN(1,99),CHOOSE(RANDBETWEEN(1,5),G4+RANDBETWEEN(1,10),ABS(G4-RANDBETWEEN(1,10)),G4,G4+RANDBETWEEN(1,100),ABS(G4-RANDBETWEEN(1,100))))))","v":290},null,{"$f":"IF(ROW()<=Worksheet!$B$5/4,K3+1,\"\")","v":42},{"$f":"RANDBETWEEN(IF(Worksheet!$B$6<=3,1,101),10^Worksheet!$B$6-1)","v":409},"<",{"$f":"IF(Worksheet!$B$6>=4,CHOOSE(RANDBETWEEN(1,5),L4+RANDBETWEEN(1,100),L4-RANDBETWEEN(1,100),L4,L4+RANDBETWEEN(101,1000),ABS(L4-RANDBETWEEN(101,1000))),IF(Worksheet!$B$6=1,RANDBETWEEN(0,9),IF(Worksheet!$B$6=2,RANDBETWEEN(1,99),CHOOSE(RANDBETWEEN(1,5),L4+RANDBETWEEN(1,10),ABS(L4-RANDBETWEEN(1,10)),L4,L4+RANDBETWEEN(1,100),ABS(L4-RANDBETWEEN(1,100))))))","v":411},null,{"$f":"IF(ROW()<=Worksheet!$B$5/4,P3+1,\"\")","v":61},{"$f":"RANDBETWEEN(IF(Worksheet!$B$6<=3,1,101),10^Worksheet!$B$6-1)","v":847},"<",{"$f":"IF(Worksheet!$B$6>=4,CHOOSE(RANDBETWEEN(1,5),Q4+RANDBETWEEN(1,100),Q4-RANDBETWEEN(1,100),Q4,Q4+RANDBETWEEN(101,1000),ABS(Q4-RANDBETWEEN(101,1000))),IF(Worksheet!$B$6=1,RANDBETWEEN(0,9),IF(Worksheet!$B$6=2,RANDBETWEEN(1,99),CHOOSE(RANDBETWEEN(1,5),Q4+RANDBETWEEN(1,10),ABS(Q4-RANDBETWEEN(1,10)),Q4,Q4+RANDBETWEEN(1,100),ABS(Q4-RANDBETWEEN(1,100))))))","v":947}]
[{"$f":"IF(ROW()<=Worksheet!$B$5/4,ROW(),\"\")","v":5},{"$f":"RANDBETWEEN(IF(Worksheet!$B$6<=3,1,101),10^Worksheet!$B$6-1)","v":888},"<",{"$f":"IF(Worksheet!$B$6>=4,CHOOSE(RANDBETWEEN(1,5),B5+RANDBETWEEN(1,100),B5-RANDBETWEEN(1,100),B5,B5+RANDBETWEEN(101,1000),ABS(B5-RANDBETWEEN(101,1000))),IF(Worksheet!$B$6=1,RANDBETWEEN(0,9),IF(Worksheet!$B$6=2,RANDBETWEEN(1,99),CHOOSE(RANDBETWEEN(1,5),B5+RANDBETWEEN(1,10),ABS(B5-RANDBETWEEN(1,10)),B5,B5+RANDBETWEEN(1,100),ABS(B5-RANDBETWEEN(1,100))))))","v":889},null,{"$f":"IF(ROW()<=Worksheet!$B$5/4,F4+1,\"\")","v":24},{"$f":"RANDBETWEEN(IF(Worksheet!$B$6<=3,1,101),10^Worksheet!$B$6-1)","v":295},"=",{"$f":"IF(Worksheet!$B$6>=4,CHOOSE(RANDBETWEEN(1,5),G5+RANDBETWEEN(1,100),G5-RANDBETWEEN(1,100),G5,G5+RANDBETWEEN(101,1000),ABS(G5-RANDBETWEEN(101,1000))),IF(Worksheet!$B$6=1,RANDBETWEEN(0,9),IF(Worksheet!$B$6=2,RANDBETWEEN(1,99),CHOOSE(RANDBETWEEN(1,5),G5+RANDBETWEEN(1,10),ABS(G5-RANDBETWEEN(1,10)),G5,G5+RANDBETWEEN(1,100),ABS(G5-RANDBETWEEN(1,100))))))","v":295},null,{"$f":"IF(ROW()<=Worksheet!$B$5/4,K4+1,\"\")","v":43},{"$f":"RANDBETWEEN(IF(Worksheet!$B$6<=3,1,101),10^Worksheet!$B$6-1)","v":450},"<",{"$f":"IF(Worksheet!$B$6>=4,CHOOSE(RANDBETWEEN(1,5),L5+RANDBETWEEN(1,100),L5-RANDBETWEEN(1,100),L5,L5+RANDBETWEEN(101,1000),ABS(L5-RANDBETWEEN(101,1000))),IF(Worksheet!$B$6=1,RANDBETWEEN(0,9),IF(Worksheet!$B$6=2,RANDBETWEEN(1,99),CHOOSE(RANDBETWEEN(1,5),L5+RANDBETWEEN(1,10),ABS(L5-RANDBETWEEN(1,10)),L5,L5+RANDBETWEEN(1,100),ABS(L5-RANDBETWEEN(1,100))))))","v":534},null,{"$f":"IF(ROW()<=Worksheet!$B$5/4,P4+1,\"\")","v":62},{"$f":"RANDBETWEEN(IF(Worksheet!$B$6<=3,1,101),10^Worksheet!$B$6-1)","v":795},"<",{"$f":"IF(Worksheet!$B$6>=4,CHOOSE(RANDBETWEEN(1,5),Q5+RANDBETWEEN(1,100),Q5-RANDBETWEEN(1,100),Q5,Q5+RANDBETWEEN(101,1000),ABS(Q5-RANDBETWEEN(101,1000))),IF(Worksheet!$B$6=1,RANDBETWEEN(0,9),IF(Worksheet!$B$6=2,RANDBETWEEN(1,99),CHOOSE(RANDBETWEEN(1,5),Q5+RANDBETWEEN(1,10),ABS(Q5-RANDBETWEEN(1,10)),Q5,Q5+RANDBETWEEN(1,100),ABS(Q5-RANDBETWEEN(1,100))))))","v":879}]
[{"$f":"IF(ROW()<=Worksheet!$B$5/4,ROW(),\"\")","v":6},{"$f":"RANDBETWEEN(IF(Worksheet!$B$6<=3,1,101),10^Worksheet!$B$6-1)","v":571},"=",{"$f":"IF(Worksheet!$B$6>=4,CHOOSE(RANDBETWEEN(1,5),B6+RANDBETWEEN(1,100),B6-RANDBETWEEN(1,100),B6,B6+RANDBETWEEN(101,1000),ABS(B6-RANDBETWEEN(101,1000))),IF(Worksheet!$B$6=1,RANDBETWEEN(0,9),IF(Worksheet!$B$6=2,RANDBETWEEN(1,99),CHOOSE(RANDBETWEEN(1,5),B6+RANDBETWEEN(1,10),ABS(B6-RANDBETWEEN(1,10)),B6,B6+RANDBETWEEN(1,100),ABS(B6-RANDBETWEEN(1,100))))))","v":571},null,{"$f":"IF(ROW()<=Worksheet!$B$5/4,F5+1,\"\")","v":25},{"$f":"RANDBETWEEN(IF(Worksheet!$B$6<=3,1,101),10^Worksheet!$B$6-1)","v":770},"<",{"$f":"IF(Worksheet!$B$6>=4,CHOOSE(RANDBETWEEN(1,5),G6+RANDBETWEEN(1,100),G6-RANDBETWEEN(1,100),G6,G6+RANDBETWEEN(101,1000),ABS(G6-RANDBETWEEN(101,1000))),IF(Worksheet!$B$6=1,RANDBETWEEN(0,9),IF(Worksheet!$B$6=2,RANDBETWEEN(1,99),CHOOSE(RANDBETWEEN(1,5),G6+RANDBETWEEN(1,10),ABS(G6-RANDBETWEEN(1,10)),G6,G6+RANDBETWEEN(1,100),ABS(G6-RANDBETWEEN(1,100))))))","v":777},null,{"$f":"IF(ROW()<=Worksheet!$B$5/4,K5+1,\"\")","v":44},{"$f":"RANDBETWEEN(IF(Worksheet!$B$6<=3,1,101),10^Worksheet!$B$6-1)","v":23},"<",{"$f":"IF(Worksheet!$B$6>=4,CHOOSE(RANDBETWEEN(1,5),L6+RANDBETWEEN(1,100),L6-RANDBETWEEN(1,100),L6,L6+RANDBETWEEN(101,1000),ABS(L6-RANDBETWEEN(101,1000))),IF(Worksheet!$B$6=1,RANDBETWEEN(0,9),IF(Worksheet!$B$6=2,RANDBETWEEN(1,99),CHOOSE(RANDBETWEEN(1,5),L6+RANDBETWEEN(1,10),ABS(L6-RANDBETWEEN(1,10)),L6,L6+RANDBETWEEN(1,100),ABS(L6-RANDBETWEEN(1,100))))))","v":44},null,{"$f":"IF(ROW()<=Worksheet!$B$5/4,P5+1,\"\")","v":63},{"$f":"RANDBETWEEN(IF(Worksheet!$B$6<=3,1,101),10^Worksheet!$B$6-1)","v":558},">",{"$f":"IF(Worksheet!$B$6>=4,CHOOSE(RANDBETWEEN(1,5),Q6+RANDBETWEEN(1,100),Q6-RANDBETWEEN(1,100),Q6,Q6+RANDBETWEEN(101,1000),ABS(Q6-RANDBETWEEN(101,1000))),IF(Worksheet!$B$6=1,RANDBETWEEN(0,9),IF(Worksheet!$B$6=2,RANDBETWEEN(1,99),CHOOSE(RANDBETWEEN(1,5),Q6+RANDBETWEEN(1,10),ABS(Q6-RANDBETWEEN(1,10)),Q6,Q6+RANDBETWEEN(1,100),ABS(Q6-RANDBETWEEN(1,100))))))","v":553}]
[{"$f":"IF(ROW()<=Worksheet!$B$5/4,ROW(),\"\")","v":7},{"$f":"RANDBETWEEN(IF(Worksheet!$B$6<=3,1,101),10^Worksheet!$B$6-1)","v":74},">",{"$f":"IF(Worksheet!$B$6>=4,CHOOSE(RANDBETWEEN(1,5),B7+RANDBETWEEN(1,100),B7-RANDBETWEEN(1,100),B7,B7+RANDBETWEEN(101,1000),ABS(B7-RANDBETWEEN(101,1000))),IF(Worksheet!$B$6=1,RANDBETWEEN(0,9),IF(Worksheet!$B$6=2,RANDBETWEEN(1,99),CHOOSE(RANDBETWEEN(1,5),B7+RANDBETWEEN(1,10),ABS(B7-RANDBETWEEN(1,10)),B7,B7+RANDBETWEEN(1,100),ABS(B7-RANDBETWEEN(1,100))))))","v":67},null,{"$f":"IF(ROW()<=Worksheet!$B$5/4,F6+1,\"\")","v":26},{"$f":"RANDBETWEEN(IF(Worksheet!$B$6<=3,1,101),10^Worksheet!$B$6-1)","v":456},">",{"$f":"IF(Worksheet!$B$6>=4,CHOOSE(RANDBETWEEN(1,5),G7+RANDBETWEEN(1,100),G7-RANDBETWEEN(1,100),G7,G7+RANDBETWEEN(101,1000),ABS(G7-RANDBETWEEN(101,1000))),IF(Worksheet!$B$6=1,RANDBETWEEN(0,9),IF(Worksheet!$B$6=2,RANDBETWEEN(1,99),CHOOSE(RANDBETWEEN(1,5),G7+RANDBETWEEN(1,10),ABS(G7-RANDBETWEEN(1,10)),G7,G7+RANDBETWEEN(1,100),ABS(G7-RANDBETWEEN(1,100))))))","v":450},null,{"$f":"IF(ROW()<=Worksheet!$B$5/4,K6+1,\"\")","v":45},{"$f":"RANDBETWEEN(IF(Worksheet!$B$6<=3,1,101),10^Worksheet!$B$6-1)","v":634},"=",{"$f":"IF(Worksheet!$B$6>=4,CHOOSE(RANDBETWEEN(1,5),L7+RANDBETWEEN(1,100),L7-RANDBETWEEN(1,100),L7,L7+RANDBETWEEN(101,1000),ABS(L7-RANDBETWEEN(101,1000))),IF(Worksheet!$B$6=1,RANDBETWEEN(0,9),IF(Worksheet!$B$6=2,RANDBETWEEN(1,99),CHOOSE(RANDBETWEEN(1,5),L7+RANDBETWEEN(1,10),ABS(L7-RANDBETWEEN(1,10)),L7,L7+RANDBETWEEN(1,100),ABS(L7-RANDBETWEEN(1,100))))))","v":634},null,{"$f":"IF(ROW()<=Worksheet!$B$5/4,P6+1,\"\")","v":64},{"$f":"RANDBETWEEN(IF(Worksheet!$B$6<=3,1,101),10^Worksheet!$B$6-1)","v":743},"=",{"$f":"IF(Worksheet!$B$6>=4,CHOOSE(RANDBETWEEN(1,5),Q7+RANDBETWEEN(1,100),Q7-RANDBETWEEN(1,100),Q7,Q7+RANDBETWEEN(101,1000),ABS(Q7-RANDBETWEEN(101,1000))),IF(Worksheet!$B$6=1,RANDBETWEEN(0,9),IF(Worksheet!$B$6=2,RANDBETWEEN(1,99),CHOOSE(RANDBETWEEN(1,5),Q7+RANDBETWEEN(1,10),ABS(Q7-RANDBETWEEN(1,10)),Q7,Q7+RANDBETWEEN(1,100),ABS(Q7-RANDBETWEEN(1,100))))))","v":743}]
[{"$f":"IF(ROW()<=Worksheet!$B$5/4,ROW(),\"\")","v":8},{"$f":"RANDBETWEEN(IF(Worksheet!$B$6<=3,1,101),10^Worksheet!$B$6-1)","v":535},"<",{"$f":"IF(Worksheet!$B$6>=4,CHOOSE(RANDBETWEEN(1,5),B8+RANDBETWEEN(1,100),B8-RANDBETWEEN(1,100),B8,B8+RANDBETWEEN(101,1000),ABS(B8-RANDBETWEEN(101,1000))),IF(Worksheet!$B$6=1,RANDBETWEEN(0,9),IF(Worksheet!$B$6=2,RANDBETWEEN(1,99),CHOOSE(RANDBETWEEN(1,5),B8+RANDBETWEEN(1,10),ABS(B8-RANDBETWEEN(1,10)),B8,B8+RANDBETWEEN(1,100),ABS(B8-RANDBETWEEN(1,100))))))","v":571},null,{"$f":"IF(ROW()<=Worksheet!$B$5/4,F7+1,\"\")","v":27},{"$f":"RANDBETWEEN(IF(Worksheet!$B$6<=3,1,101),10^Worksheet!$B$6-1)","v":673},"<",{"$f":"IF(Worksheet!$B$6>=4,CHOOSE(RANDBETWEEN(1,5),G8+RANDBETWEEN(1,100),G8-RANDBETWEEN(1,100),G8,G8+RANDBETWEEN(101,1000),ABS(G8-RANDBETWEEN(101,1000))),IF(Worksheet!$B$6=1,RANDBETWEEN(0,9),IF(Worksheet!$B$6=2,RANDBETWEEN(1,99),CHOOSE(RANDBETWEEN(1,5),G8+RANDBETWEEN(1,10),ABS(G8-RANDBETWEEN(1,10)),G8,G8+RANDBETWEEN(1,100),ABS(G8-RANDBETWEEN(1,100))))))","v":681},null,{"$f":"IF(ROW()<=Worksheet!$B$5/4,K7+1,\"\")","v":46},{"$f":"RANDBETWEEN(IF(Worksheet!$B$6<=3,1,101),10^Worksheet!$B$6-1)","v":876},">",{"$f":"IF(Worksheet!$B$6>=4,CHOOSE(RANDBETWEEN(1,5),L8+RANDBETWEEN(1,100),L8-RANDBETWEEN(1,100),L8,L8+RANDBETWEEN(101,1000),ABS(L8-RANDBETWEEN(101,1000))),IF(Worksheet!$B$6=1,RANDBETWEEN(0,9),IF(Worksheet!$B$6=2,RANDBETWEEN(1,99),CHOOSE(RANDBETWEEN(1,5),L8+RANDBETWEEN(1,10),ABS(L8-RANDBETWEEN(1,10)),L8,L8+RANDBETWEEN(1,100),ABS(L8-RANDBETWEEN(1,100))))))","v":780},null,{"$f":"IF(ROW()<=Worksheet!$B$5/4,P7+1,\"\")","v":65},{"$f":"RANDBETWEEN(IF(Worksheet!$B$6<=3,1,101),10^Worksheet!$B$6-1)","v":445},"<",{"$f":"IF(Worksheet!$B$6>=4,CHOOSE(RANDBETWEEN(1,5),Q8+RANDBETWEEN(1,100),Q8-RANDBETWEEN(1,100),Q8,Q8+RANDBETWEEN(101,1000),ABS(Q8-RANDBETWEEN(101,1000))),IF(Worksheet!$B$6=1,RANDBETWEEN(0,9),IF(Worksheet!$B$6=2,RANDBETWEEN(1,99),CHOOSE(RANDBETWEEN(1,5),Q8+RANDBETWEEN(1,10),ABS(Q8-RANDBETWEEN(1,10)),Q8,Q8+RANDBETWEEN(1,100),ABS(Q8-RANDBETWEEN(1,100))))))","v":453}]
[{"$f":"IF(ROW()<=Worksheet!$B$5/4,ROW(),\"\")","v":9},{"$f":"RANDBETWEEN(IF(Worksheet!$B$6<=3,1,101),10^Worksheet!$B$6-1)","v":222},">",{"$f":"IF(Worksheet!$B$6>=4,CHOOSE(RANDBETWEEN(1,5),B9+RANDBETWEEN(1,100),B9-RANDBETWEEN(1,100),B9,B9+RANDBETWEEN(101,1000),ABS(B9-RANDBETWEEN(101,1000))),IF(Worksheet!$B$6=1,RANDBETWEEN(0,9),IF(Worksheet!$B$6=2,RANDBETWEEN(1,99),CHOOSE(RANDBETWEEN(1,5),B9+RANDBETWEEN(1,10),ABS(B9-RANDBETWEEN(1,10)),B9,B9+RANDBETWEEN(1,100),ABS(B9-RANDBETWEEN(1,100))))))","v":213},null,{"$f":"IF(ROW()<=Worksheet!$B$5/4,F8+1,\"\")","v":28},{"$f":"RANDBETWEEN(IF(Worksheet!$B$6<=3,1,101),10^Worksheet!$B$6-1)","v":987},"=",{"$f":"IF(Worksheet!$B$6>=4,CHOOSE(RANDBETWEEN(1,5),G9+RANDBETWEEN(1,100),G9-RANDBETWEEN(1,100),G9,G9+RANDBETWEEN(101,1000),ABS(G9-RANDBETWEEN(101,1000))),IF(Worksheet!$B$6=1,RANDBETWEEN(0,9),IF(Worksheet!$B$6=2,RANDBETWEEN(1,99),CHOOSE(RANDBETWEEN(1,5),G9+RANDBETWEEN(1,10),ABS(G9-RANDBETWEEN(1,10)),G9,G9+RANDBETWEEN(1,100),ABS(G9-RANDBETWEEN(1,100))))))","v":987},null,{"$f":"IF(ROW()<=Worksheet!$B$5/4,K8+1,\"\")","v":47},{"$f":"RANDBETWEEN(IF(Worksheet!$B$6<=3,1,101),10^Worksheet!$B$6-1)","v":724},">",{"$f":"IF(Worksheet!$B$6>=4,CHOOSE(RANDBETWEEN(1,5),L9+RANDBETWEEN(1,100),L9-RANDBETWEEN(1,100),L9,L9+RANDBETWEEN(101,1000),ABS(L9-RANDBETWEEN(101,1000))),IF(Worksheet!$B$6=1,RANDBETWEEN(0,9),IF(Worksheet!$B$6=2,RANDBETWEEN(1,99),CHOOSE(RANDBETWEEN(1,5),L9+RANDBETWEEN(1,10),ABS(L9-RANDBETWEEN(1,10)),L9,L9+RANDBETWEEN(1,100),ABS(L9-RANDBETWEEN(1,100))))))","v":671},null,{"$f":"IF(ROW()<=Worksheet!$B$5/4,P8+1,\"\")","v":66},{"$f":"RANDBETWEEN(IF(Worksheet!$B$6<=3,1,101),10^Worksheet!$B$6-1)","v":61},"<",{"$f":"IF(Worksheet!$B$6>=4,CHOOSE(RANDBETWEEN(1,5),Q9+RANDBETWEEN(1,100),Q9-RANDBETWEEN(1,100),Q9,Q9+RANDBETWEEN(101,1000),ABS(Q9-RANDBETWEEN(101,1000))),IF(Worksheet!$B$6=1,RANDBETWEEN(0,9),IF(Worksheet!$B$6=2,RANDBETWEEN(1,99),CHOOSE(RANDBETWEEN(1,5),Q9+RANDBETWEEN(1,10),ABS(Q9-RANDBETWEEN(1,10)),Q9,Q9+RANDBETWEEN(1,100),ABS(Q9-RANDBETWEEN(1,100))))))","v":71}]
[{"$f":"IF(ROW()<=Worksheet!$B$5/4,ROW(),\"\")","v":10},{"$f":"RANDBETWEEN(IF(Worksheet!$B$6<=3,1,101),10^Worksheet!$B$6-1)","v":273},"=",{"$f":"IF(Worksheet!$B$6>=4,CHOOSE(RANDBETWEEN(1,5),B10+RANDBETWEEN(1,100),B10-RANDBETWEEN(1,100),B10,B10+RANDBETWEEN(101,1000),ABS(B10-RANDBETWEEN(101,1000))),IF(Worksheet!$B$6=1,RANDBETWEEN(0,9),IF(Worksheet!$B$6=2,RANDBETWEEN(1,99),CHOOSE(RANDBETWEEN(1,5),B10+RANDBETWEEN(1,10),ABS(B10-RANDBETWEEN(1,10)),B10,B10+RANDBETWEEN(1,100),ABS(B10-RANDBETWEEN(1,100))))))","v":273},null,{"$f":"IF(ROW()<=Worksheet!$B$5/4,F9+1,\"\")","v":29},{"$f":"RANDBETWEEN(IF(Worksheet!$B$6<=3,1,101),10^Worksheet!$B$6-1)","v":149},"=",{"$f":"IF(Worksheet!$B$6>=4,CHOOSE(RANDBETWEEN(1,5),G10+RANDBETWEEN(1,100),G10-RANDBETWEEN(1,100),G10,G10+RANDBETWEEN(101,1000),ABS(G10-RANDBETWEEN(101,1000))),IF(Worksheet!$B$6=1,RANDBETWEEN(0,9),IF(Worksheet!$B$6=2,RANDBETWEEN(1,99),CHOOSE(RANDBETWEEN(1,5),G10+RANDBETWEEN(1,10),ABS(G10-RANDBETWEEN(1,10)),G10,G10+RANDBETWEEN(1,100),ABS(G10-RANDBETWEEN(1,100))))))","v":149},null,{"$f":"IF(ROW()<=Worksheet!$B$5/4,K9+1,\"\")","v":48},{"$f":"RANDBETWEEN(IF(Worksheet!$B$6<=3,1,101),10^Worksheet!$B$6-1)","v":631},"<",{"$f":"IF(Worksheet!$B$6>=4,CHOOSE(RANDBETWEEN(1,5),L10+RANDBETWEEN(1,100),L10-RANDBETWEEN(1,100),L10,L10+RANDBETWEEN(101,1000),ABS(L10-RANDBETWEEN(101,1000))),IF(Worksheet!$B$6=1,RANDBETWEEN(0,9),IF(Worksheet!$B$6=2,RANDBETWEEN(1,99),CHOOSE(RANDBETWEEN(1,5),L10+RANDBETWEEN(1,10),ABS(L10-RANDBETWEEN(1,10)),L10,L10+RANDBETWEEN(1,100),ABS(L10-RANDBETWEEN(1,100))))))","v":662},null,{"$f":"IF(ROW()<=Worksheet!$B$5/4,P9+1,\"\")","v":67},{"$f":"RANDBETWEEN(IF(Worksheet!$B$6<=3,1,101),10^Worksheet!$B$6-1)","v":890},"=",{"$f":"IF(Worksheet!$B$6>=4,CHOOSE(RANDBETWEEN(1,5),Q10+RANDBETWEEN(1,100),Q10-RANDBETWEEN(1,100),Q10,Q10+RANDBETWEEN(101,1000),ABS(Q10-RANDBETWEEN(101,1000))),IF(Worksheet!$B$6=1,RANDBETWEEN(0,9),IF(Worksheet!$B$6=2,RANDBETWEEN(1,99),CHOOSE(RANDBETWEEN(1,5),Q10+RANDBETWEEN(1,10),ABS(Q10-RANDBETWEEN(1,10)),Q10,Q10+RANDBETWEEN(1,100),ABS(Q10-RANDBETWEEN(1,100))))))","v":890}]
{"$rows_left_out":10}