{"text_format":"1","workbook":"xlsx","n_sheets":3,"sheets":["Worksheet","SYSTEM FORMULAE","System DO NOT OPEN"],"not_rendered":{"charts":0,"images":0,"macros":1,"external_links":0,"defined_names":8,"comments":0,"pivot_tables":0},"unopened":[],"bounds":{"document_bytes":16777216,"sheet_cells":100000,"rows_first":2000,"rows_last":500,"rows_between":2000,"halvings":0,"cell_chars":16384,"cell_head_chars":4096},"cells_cut":0,"cells_raw":0,"read":"whole","date_system":"1900"}

{"sheet":"Worksheet","index":0,"n_rows":22,"n_cols":11,"rows_kept":22,"cut":false,"hidden":false,"merged":[[0,5,0,6],[1,5,1,6],[0,0,0,3]]}
["Variables"]
[null,null,null,null,null,"National 4: Non-calculator practice",null,"Answers  (this column does not print by default)"]
[null,null,null,{"$f":"IF(K3=1,\"Easier\",IF(K3=2,\"Medium\",\"Harder\"))","v":"Easier"},null,1,"Multiply:           5.5 × 900","4950",null,null,1]
[null,null,null,{"$f":"IF(K4=1,\"Easier\",IF(K4=2,\"Medium\",\"Harder\"))","v":"Easier"},null,2,"Divide:           (-90) ÷ (-9)","810",null,null,1]
[null,null,null,"Easier",null,3,"Divide:           8000 ÷ 40","200",null,null,1]
[null,null,null,"Easier",null,4,"25% of 2000","500",null,null,1]
[null,null,null,"Medium",null,5,"490 – 10 × 13","360",null,null,2]
[null,null,null,"Medium",null,6,"182 + 12 × 15","362",null,null,2]
[null,null,null,"Medium",null,7,"4 × 2.5 × 4.9","49",null,null,2]
[null,null,null,"Medium",null,8,"8 + 2 × (-10)","-12",null,null,2]
[null,null,null,"Medium",null,9,"4 × (-4) × 5","-80",null,null,2]
[null,null,null,"Medium",null,10,"8 × (2  1/3)","18 2/3",null,null,2]
[null,null,null,"Medium",null,11,"(-9) × 0  + 1","1",null,null,2]
[null,null,null,"Medium",null,12,"15 × 17 + 36","291",null,null,2]
[null,null,null,"Medium",null,13,"(-8) × 9 –7","-79",null,null,2]
{"$rows_left_out":8}
{"sheet":"SYSTEM FORMULAE","index":1,"n_rows":20,"n_cols":21,"rows_kept":20,"cut":false,"hidden":false,"merged":[]}
[{"$f":"Worksheet!D3","v":"Easier"},{"$f":"IF($A1=\"Easier\",RANDBETWEEN(1,Easy),IF($A1=\"Medium\",RANDBETWEEN(Easy+1,Easy+Medium),IF($A1=\"Harder\",RANDBETWEEN(Easy+Medium+1,Easy+Medium+Hard),RANDBETWEEN(1,Easy+Medium+Hard))))","v":9},{"$f":"IF(COUNTIF(B$1:B1,B1)<>1,IF($A1=\"Easier\",RANDBETWEEN(1,Easy),IF($A1=\"Medium\",RANDBETWEEN(Easy+1,Easy+Medium),IF($A1=\"Harder\",RANDBETWEEN(Easy+Medium+1,Easy+Medium+Hard),RANDBETWEEN(1,Easy+Medium+Hard)))),B1)","v":9},{"$f":"IF(COUNTIF(C$1:C1,C1)<>1,IF($A1=\"Easier\",RANDBETWEEN(1,Easy),IF($A1=\"Medium\",RANDBETWEEN(Easy+1,Easy+Medium),IF($A1=\"Harder\",RANDBETWEEN(Easy+Medium+1,Easy+Medium+Hard),RANDBETWEEN(1,Easy+Medium+Hard)))),C1)","v":9},{"$f":"IF(COUNTIF(D$1:D1,D1)<>1,IF($A1=\"Easier\",RANDBETWEEN(1,Easy),IF($A1=\"Medium\",RANDBETWEEN(Easy+1,Easy+Medium),IF($A1=\"Harder\",RANDBETWEEN(Easy+Medium+1,Easy+Medium+Hard),RANDBETWEEN(1,Easy+Medium+Hard)))),D1)","v":9},{"$f":"IF(COUNTIF(E$1:E1,E1)<>1,IF($A1=\"Easier\",RANDBETWEEN(1,Easy),IF($A1=\"Medium\",RANDBETWEEN(Easy+1,Easy+Medium),IF($A1=\"Harder\",RANDBETWEEN(Easy+Medium+1,Easy+Medium+Hard),RANDBETWEEN(1,Easy+Medium+Hard)))),E1)","v":9},1,{"$f":"VLOOKUP($F1,'System DO NOT OPEN'!$A$8:$P$200,11)","v":"75% of 2800"},{"$f":"VLOOKUP($F1,'System DO NOT OPEN'!$A$8:$P$200,16)","v":"2100"},null,null,null,null,null,null,null,null,null,null,null,"shading shapes"]
[{"$f":"Worksheet!D4","v":"Easier"},18,{"$f":"IF(COUNTIF(B$1:B2,B2)<>1,IF($A2=\"Easier\",RANDBETWEEN(1,Easy),IF($A2=\"Medium\",RANDBETWEEN(Easy+1,Easy+Medium),IF($A2=\"Harder\",RANDBETWEEN(Easy+Medium+1,Easy+Medium+Hard),RANDBETWEEN(1,Easy+Medium+Hard)))),B2)","v":18},{"$f":"IF(COUNTIF(C$1:C2,C2)<>1,IF($A2=\"Easier\",RANDBETWEEN(1,Easy),IF($A2=\"Medium\",RANDBETWEEN(Easy+1,Easy+Medium),IF($A2=\"Harder\",RANDBETWEEN(Easy+Medium+1,Easy+Medium+Hard),RANDBETWEEN(1,Easy+Medium+Hard)))),C2)","v":18},{"$f":"IF(COUNTIF(D$1:D2,D2)<>1,IF($A2=\"Easier\",RANDBETWEEN(1,Easy),IF($A2=\"Medium\",RANDBETWEEN(Easy+1,Easy+Medium),IF($A2=\"Harder\",RANDBETWEEN(Easy+Medium+1,Easy+Medium+Hard),RANDBETWEEN(1,Easy+Medium+Hard)))),D2)","v":18},{"$f":"IF(COUNTIF(E$1:E2,E2)<>1,IF($A2=\"Easier\",RANDBETWEEN(1,Easy),IF($A2=\"Medium\",RANDBETWEEN(Easy+1,Easy+Medium),IF($A2=\"Harder\",RANDBETWEEN(Easy+Medium+1,Easy+Medium+Hard),RANDBETWEEN(1,Easy+Medium+Hard)))),E2)","v":18},2,{"$f":"VLOOKUP($F2,'System DO NOT OPEN'!$A$8:$P$200,11)","v":"Divide:           320000 ÷ 400"},{"$f":"VLOOKUP($F2,'System DO NOT OPEN'!$A$8:$P$200,16)","v":"800"},null,null,null,null,null,null,null,null,null,null,null,"how many 4p grapes for 28p"]
[{"$f":"Worksheet!D5","v":"Easier"},19,{"$f":"IF(COUNTIF(B$1:B3,B3)<>1,IF($A3=\"Easier\",RANDBETWEEN(1,Easy),IF($A3=\"Medium\",RANDBETWEEN(Easy+1,Easy+Medium),IF($A3=\"Harder\",RANDBETWEEN(Easy+Medium+1,Easy+Medium+Hard),RANDBETWEEN(1,Easy+Medium+Hard)))),B3)","v":19},{"$f":"IF(COUNTIF(C$1:C3,C3)<>1,IF($A3=\"Easier\",RANDBETWEEN(1,Easy),IF($A3=\"Medium\",RANDBETWEEN(Easy+1,Easy+Medium),IF($A3=\"Harder\",RANDBETWEEN(Easy+Medium+1,Easy+Medium+Hard),RANDBETWEEN(1,Easy+Medium+Hard)))),C3)","v":19},{"$f":"IF(COUNTIF(D$1:D3,D3)<>1,IF($A3=\"Easier\",RANDBETWEEN(1,Easy),IF($A3=\"Medium\",RANDBETWEEN(Easy+1,Easy+Medium),IF($A3=\"Harder\",RANDBETWEEN(Easy+Medium+1,Easy+Medium+Hard),RANDBETWEEN(1,Easy+Medium+Hard)))),D3)","v":19},{"$f":"IF(COUNTIF(E$1:E3,E3)<>1,IF($A3=\"Easier\",RANDBETWEEN(1,Easy),IF($A3=\"Medium\",RANDBETWEEN(Easy+1,Easy+Medium),IF($A3=\"Harder\",RANDBETWEEN(Easy+Medium+1,Easy+Medium+Hard),RANDBETWEEN(1,Easy+Medium+Hard)))),E3)","v":19},3,{"$f":"VLOOKUP($F3,'System DO NOT OPEN'!$A$8:$P$200,11)","v":"Divide:              140 ÷ 4"},{"$f":"VLOOKUP($F3,'System DO NOT OPEN'!$A$8:$P$200,16)","v":"35"},null,null,null,null,null,null,null,null,null,null,null,"what do 9 pencils cost at 10p each"]
[{"$f":"Worksheet!D6","v":"Easier"},22,{"$f":"IF(COUNTIF(B$1:B4,B4)<>1,IF($A4=\"Easier\",RANDBETWEEN(1,Easy),IF($A4=\"Medium\",RANDBETWEEN(Easy+1,Easy+Medium),IF($A4=\"Harder\",RANDBETWEEN(Easy+Medium+1,Easy+Medium+Hard),RANDBETWEEN(1,Easy+Medium+Hard)))),B4)","v":22},{"$f":"IF(COUNTIF(C$1:C4,C4)<>1,IF($A4=\"Easier\",RANDBETWEEN(1,Easy),IF($A4=\"Medium\",RANDBETWEEN(Easy+1,Easy+Medium),IF($A4=\"Harder\",RANDBETWEEN(Easy+Medium+1,Easy+Medium+Hard),RANDBETWEEN(1,Easy+Medium+Hard)))),C4)","v":22},{"$f":"IF(COUNTIF(D$1:D4,D4)<>1,IF($A4=\"Easier\",RANDBETWEEN(1,Easy),IF($A4=\"Medium\",RANDBETWEEN(Easy+1,Easy+Medium),IF($A4=\"Harder\",RANDBETWEEN(Easy+Medium+1,Easy+Medium+Hard),RANDBETWEEN(1,Easy+Medium+Hard)))),D4)","v":22},{"$f":"IF(COUNTIF(E$1:E4,E4)<>1,IF($A4=\"Easier\",RANDBETWEEN(1,Easy),IF($A4=\"Medium\",RANDBETWEEN(Easy+1,Easy+Medium),IF($A4=\"Harder\",RANDBETWEEN(Easy+Medium+1,Easy+Medium+Hard),RANDBETWEEN(1,Easy+Medium+Hard)))),E4)","v":22},4,{"$f":"VLOOKUP($F4,'System DO NOT OPEN'!$A$8:$P$200,11)","v":"5% of 14200"},{"$f":"VLOOKUP($F4,'System DO NOT OPEN'!$A$8:$P$200,16)","v":"710"},null,null,null,null,null,null,null,null,null,null,null,"pounds/pence"]
[{"$f":"Worksheet!D7","v":"Medium"},45,{"$f":"IF(COUNTIF(B$1:B5,B5)<>1,IF($A5=\"Easier\",RANDBETWEEN(1,Easy),IF($A5=\"Medium\",RANDBETWEEN(Easy+1,Easy+Medium),IF($A5=\"Harder\",RANDBETWEEN(Easy+Medium+1,Easy+Medium+Hard),RANDBETWEEN(1,Easy+Medium+Hard)))),B5)","v":45},{"$f":"IF(COUNTIF(C$1:C5,C5)<>1,IF($A5=\"Easier\",RANDBETWEEN(1,Easy),IF($A5=\"Medium\",RANDBETWEEN(Easy+1,Easy+Medium),IF($A5=\"Harder\",RANDBETWEEN(Easy+Medium+1,Easy+Medium+Hard),RANDBETWEEN(1,Easy+Medium+Hard)))),C5)","v":45},{"$f":"IF(COUNTIF(D$1:D5,D5)<>1,IF($A5=\"Easier\",RANDBETWEEN(1,Easy),IF($A5=\"Medium\",RANDBETWEEN(Easy+1,Easy+Medium),IF($A5=\"Harder\",RANDBETWEEN(Easy+Medium+1,Easy+Medium+Hard),RANDBETWEEN(1,Easy+Medium+Hard)))),D5)","v":45},{"$f":"IF(COUNTIF(E$1:E5,E5)<>1,IF($A5=\"Easier\",RANDBETWEEN(1,Easy),IF($A5=\"Medium\",RANDBETWEEN(Easy+1,Easy+Medium),IF($A5=\"Harder\",RANDBETWEEN(Easy+Medium+1,Easy+Medium+Hard),RANDBETWEEN(1,Easy+Medium+Hard)))),E5)","v":45},5,{"$f":"VLOOKUP($F5,'System DO NOT OPEN'!$A$8:$P$200,11)","v":"4 × 2.5 × 6.8"},{"$f":"VLOOKUP($F5,'System DO NOT OPEN'!$A$8:$P$200,16)","v":"68"}]
[{"$f":"Worksheet!D8","v":"Medium"},32,{"$f":"IF(COUNTIF(B$1:B6,B6)<>1,IF($A6=\"Easier\",RANDBETWEEN(1,Easy),IF($A6=\"Medium\",RANDBETWEEN(Easy+1,Easy+Medium),IF($A6=\"Harder\",RANDBETWEEN(Easy+Medium+1,Easy+Medium+Hard),RANDBETWEEN(1,Easy+Medium+Hard)))),B6)","v":32},{"$f":"IF(COUNTIF(C$1:C6,C6)<>1,IF($A6=\"Easier\",RANDBETWEEN(1,Easy),IF($A6=\"Medium\",RANDBETWEEN(Easy+1,Easy+Medium),IF($A6=\"Harder\",RANDBETWEEN(Easy+Medium+1,Easy+Medium+Hard),RANDBETWEEN(1,Easy+Medium+Hard)))),C6)","v":32},{"$f":"IF(COUNTIF(D$1:D6,D6)<>1,IF($A6=\"Easier\",RANDBETWEEN(1,Easy),IF($A6=\"Medium\",RANDBETWEEN(Easy+1,Easy+Medium),IF($A6=\"Harder\",RANDBETWEEN(Easy+Medium+1,Easy+Medium+Hard),RANDBETWEEN(1,Easy+Medium+Hard)))),D6)","v":32},{"$f":"IF(COUNTIF(E$1:E6,E6)<>1,IF($A6=\"Easier\",RANDBETWEEN(1,Easy),IF($A6=\"Medium\",RANDBETWEEN(Easy+1,Easy+Medium),IF($A6=\"Harder\",RANDBETWEEN(Easy+Medium+1,Easy+Medium+Hard),RANDBETWEEN(1,Easy+Medium+Hard)))),E6)","v":32},6,{"$f":"VLOOKUP($F6,'System DO NOT OPEN'!$A$8:$P$200,11)","v":"(-4) × (-9)  + 1"},{"$f":"VLOOKUP($F6,'System DO NOT OPEN'!$A$8:$P$200,16)","v":"37"}]
[{"$f":"Worksheet!D9","v":"Medium"},47,{"$f":"IF(COUNTIF(B$1:B7,B7)<>1,IF($A7=\"Easier\",RANDBETWEEN(1,Easy),IF($A7=\"Medium\",RANDBETWEEN(Easy+1,Easy+Medium),IF($A7=\"Harder\",RANDBETWEEN(Easy+Medium+1,Easy+Medium+Hard),RANDBETWEEN(1,Easy+Medium+Hard)))),B7)","v":47},{"$f":"IF(COUNTIF(C$1:C7,C7)<>1,IF($A7=\"Easier\",RANDBETWEEN(1,Easy),IF($A7=\"Medium\",RANDBETWEEN(Easy+1,Easy+Medium),IF($A7=\"Harder\",RANDBETWEEN(Easy+Medium+1,Easy+Medium+Hard),RANDBETWEEN(1,Easy+Medium+Hard)))),C7)","v":47},{"$f":"IF(COUNTIF(D$1:D7,D7)<>1,IF($A7=\"Easier\",RANDBETWEEN(1,Easy),IF($A7=\"Medium\",RANDBETWEEN(Easy+1,Easy+Medium),IF($A7=\"Harder\",RANDBETWEEN(Easy+Medium+1,Easy+Medium+Hard),RANDBETWEEN(1,Easy+Medium+Hard)))),D7)","v":47},{"$f":"IF(COUNTIF(E$1:E7,E7)<>1,IF($A7=\"Easier\",RANDBETWEEN(1,Easy),IF($A7=\"Medium\",RANDBETWEEN(Easy+1,Easy+Medium),IF($A7=\"Harder\",RANDBETWEEN(Easy+Medium+1,Easy+Medium+Hard),RANDBETWEEN(1,Easy+Medium+Hard)))),E7)","v":47},7,{"$f":"VLOOKUP($F7,'System DO NOT OPEN'!$A$8:$P$200,11)","v":"280 – (45 ÷ 9)"},{"$f":"VLOOKUP($F7,'System DO NOT OPEN'!$A$8:$P$200,16)","v":"275"}]
[{"$f":"Worksheet!D10","v":"Medium"},42,{"$f":"IF(COUNTIF(B$1:B8,B8)<>1,IF($A8=\"Easier\",RANDBETWEEN(1,Easy),IF($A8=\"Medium\",RANDBETWEEN(Easy+1,Easy+Medium),IF($A8=\"Harder\",RANDBETWEEN(Easy+Medium+1,Easy+Medium+Hard),RANDBETWEEN(1,Easy+Medium+Hard)))),B8)","v":42},{"$f":"IF(COUNTIF(C$1:C8,C8)<>1,IF($A8=\"Easier\",RANDBETWEEN(1,Easy),IF($A8=\"Medium\",RANDBETWEEN(Easy+1,Easy+Medium),IF($A8=\"Harder\",RANDBETWEEN(Easy+Medium+1,Easy+Medium+Hard),RANDBETWEEN(1,Easy+Medium+Hard)))),C8)","v":42},{"$f":"IF(COUNTIF(D$1:D8,D8)<>1,IF($A8=\"Easier\",RANDBETWEEN(1,Easy),IF($A8=\"Medium\",RANDBETWEEN(Easy+1,Easy+Medium),IF($A8=\"Harder\",RANDBETWEEN(Easy+Medium+1,Easy+Medium+Hard),RANDBETWEEN(1,Easy+Medium+Hard)))),D8)","v":42},{"$f":"IF(COUNTIF(E$1:E8,E8)<>1,IF($A8=\"Easier\",RANDBETWEEN(1,Easy),IF($A8=\"Medium\",RANDBETWEEN(Easy+1,Easy+Medium),IF($A8=\"Harder\",RANDBETWEEN(Easy+Medium+1,Easy+Medium+Hard),RANDBETWEEN(1,Easy+Medium+Hard)))),E8)","v":42},8,{"$f":"VLOOKUP($F8,'System DO NOT OPEN'!$A$8:$P$200,11)","v":"85 + 14 × 15"},{"$f":"VLOOKUP($F8,'System DO NOT OPEN'!$A$8:$P$200,16)","v":"295"}]
[{"$f":"Worksheet!D11","v":"Medium"},36,{"$f":"IF(COUNTIF(B$1:B9,B9)<>1,IF($A9=\"Easier\",RANDBETWEEN(1,Easy),IF($A9=\"Medium\",RANDBETWEEN(Easy+1,Easy+Medium),IF($A9=\"Harder\",RANDBETWEEN(Easy+Medium+1,Easy+Medium+Hard),RANDBETWEEN(1,Easy+Medium+Hard)))),B9)","v":36},{"$f":"IF(COUNTIF(C$1:C9,C9)<>1,IF($A9=\"Easier\",RANDBETWEEN(1,Easy),IF($A9=\"Medium\",RANDBETWEEN(Easy+1,Easy+Medium),IF($A9=\"Harder\",RANDBETWEEN(Easy+Medium+1,Easy+Medium+Hard),RANDBETWEEN(1,Easy+Medium+Hard)))),C9)","v":36},{"$f":"IF(COUNTIF(D$1:D9,D9)<>1,IF($A9=\"Easier\",RANDBETWEEN(1,Easy),IF($A9=\"Medium\",RANDBETWEEN(Easy+1,Easy+Medium),IF($A9=\"Harder\",RANDBETWEEN(Easy+Medium+1,Easy+Medium+Hard),RANDBETWEEN(1,Easy+Medium+Hard)))),D9)","v":36},{"$f":"IF(COUNTIF(E$1:E9,E9)<>1,IF($A9=\"Easier\",RANDBETWEEN(1,Easy),IF($A9=\"Medium\",RANDBETWEEN(Easy+1,Easy+Medium),IF($A9=\"Harder\",RANDBETWEEN(Easy+Medium+1,Easy+Medium+Hard),RANDBETWEEN(1,Easy+Medium+Hard)))),E9)","v":36},9,{"$f":"VLOOKUP($F9,'System DO NOT OPEN'!$A$8:$P$200,11)","v":"£1.65 × 300"},{"$f":"VLOOKUP($F9,'System DO NOT OPEN'!$A$8:$P$200,16)","v":"£495.00"}]
[{"$f":"Worksheet!D12","v":"Medium"},44,{"$f":"IF(COUNTIF(B$1:B10,B10)<>1,IF($A10=\"Easier\",RANDBETWEEN(1,Easy),IF($A10=\"Medium\",RANDBETWEEN(Easy+1,Easy+Medium),IF($A10=\"Harder\",RANDBETWEEN(Easy+Medium+1,Easy+Medium+Hard),RANDBETWEEN(1,Easy+Medium+Hard)))),B10)","v":44},{"$f":"IF(COUNTIF(C$1:C10,C10)<>1,IF($A10=\"Easier\",RANDBETWEEN(1,Easy),IF($A10=\"Medium\",RANDBETWEEN(Easy+1,Easy+Medium),IF($A10=\"Harder\",RANDBETWEEN(Easy+Medium+1,Easy+Medium+Hard),RANDBETWEEN(1,Easy+Medium+Hard)))),C10)","v":44},{"$f":"IF(COUNTIF(D$1:D10,D10)<>1,IF($A10=\"Easier\",RANDBETWEEN(1,Easy),IF($A10=\"Medium\",RANDBETWEEN(Easy+1,Easy+Medium),IF($A10=\"Harder\",RANDBETWEEN(Easy+Medium+1,Easy+Medium+Hard),RANDBETWEEN(1,Easy+Medium+Hard)))),D10)","v":44},{"$f":"IF(COUNTIF(E$1:E10,E10)<>1,IF($A10=\"Easier\",RANDBETWEEN(1,Easy),IF($A10=\"Medium\",RANDBETWEEN(Easy+1,Easy+Medium),IF($A10=\"Harder\",RANDBETWEEN(Easy+Medium+1,Easy+Medium+Hard),RANDBETWEEN(1,Easy+Medium+Hard)))),E10)","v":44},10,{"$f":"VLOOKUP($F10,'System DO NOT OPEN'!$A$8:$P$200,11)","v":"180 ÷ 4 ÷ 5"},{"$f":"VLOOKUP($F10,'System DO NOT OPEN'!$A$8:$P$200,16)","v":"9"}]
[{"$f":"Worksheet!D13","v":"Medium"},31,{"$f":"IF(COUNTIF(B$1:B11,B11)<>1,IF($A11=\"Easier\",RANDBETWEEN(1,Easy),IF($A11=\"Medium\",RANDBETWEEN(Easy+1,Easy+Medium),IF($A11=\"Harder\",RANDBETWEEN(Easy+Medium+1,Easy+Medium+Hard),RANDBETWEEN(1,Easy+Medium+Hard)))),B11)","v":31},{"$f":"IF(COUNTIF(C$1:C11,C11)<>1,IF($A11=\"Easier\",RANDBETWEEN(1,Easy),IF($A11=\"Medium\",RANDBETWEEN(Easy+1,Easy+Medium),IF($A11=\"Harder\",RANDBETWEEN(Easy+Medium+1,Easy+Medium+Hard),RANDBETWEEN(1,Easy+Medium+Hard)))),C11)","v":31},{"$f":"IF(COUNTIF(D$1:D11,D11)<>1,IF($A11=\"Easier\",RANDBETWEEN(1,Easy),IF($A11=\"Medium\",RANDBETWEEN(Easy+1,Easy+Medium),IF($A11=\"Harder\",RANDBETWEEN(Easy+Medium+1,Easy+Medium+Hard),RANDBETWEEN(1,Easy+Medium+Hard)))),D11)","v":31},{"$f":"IF(COUNTIF(E$1:E11,E11)<>1,IF($A11=\"Easier\",RANDBETWEEN(1,Easy),IF($A11=\"Medium\",RANDBETWEEN(Easy+1,Easy+Medium),IF($A11=\"Harder\",RANDBETWEEN(Easy+Medium+1,Easy+Medium+Hard),RANDBETWEEN(1,Easy+Medium+Hard)))),E11)","v":31},11,{"$f":"VLOOKUP($F11,'System DO NOT OPEN'!$A$8:$P$200,11)","v":"(-1) × 2 + 2"},{"$f":"VLOOKUP($F11,'System DO NOT OPEN'!$A$8:$P$200,16)","v":"0"}]
[{"$f":"Worksheet!D14","v":"Medium"},34,{"$f":"IF(COUNTIF(B$1:B12,B12)<>1,IF($A12=\"Easier\",RANDBETWEEN(1,Easy),IF($A12=\"Medium\",RANDBETWEEN(Easy+1,Easy+Medium),IF($A12=\"Harder\",RANDBETWEEN(Easy+Medium+1,Easy+Medium+Hard),RANDBETWEEN(1,Easy+Medium+Hard)))),B12)","v":34},{"$f":"IF(COUNTIF(C$1:C12,C12)<>1,IF($A12=\"Easier\",RANDBETWEEN(1,Easy),IF($A12=\"Medium\",RANDBETWEEN(Easy+1,Easy+Medium),IF($A12=\"Harder\",RANDBETWEEN(Easy+Medium+1,Easy+Medium+Hard),RANDBETWEEN(1,Easy+Medium+Hard)))),C12)","v":34},{"$f":"IF(COUNTIF(D$1:D12,D12)<>1,IF($A12=\"Easier\",RANDBETWEEN(1,Easy),IF($A12=\"Medium\",RANDBETWEEN(Easy+1,Easy+Medium),IF($A12=\"Harder\",RANDBETWEEN(Easy+Medium+1,Easy+Medium+Hard),RANDBETWEEN(1,Easy+Medium+Hard)))),D12)","v":34},{"$f":"IF(COUNTIF(E$1:E12,E12)<>1,IF($A12=\"Easier\",RANDBETWEEN(1,Easy),IF($A12=\"Medium\",RANDBETWEEN(Easy+1,Easy+Medium),IF($A12=\"Harder\",RANDBETWEEN(Easy+Medium+1,Easy+Medium+Hard),RANDBETWEEN(1,Easy+Medium+Hard)))),E12)","v":34},12,{"$f":"VLOOKUP($F12,'System DO NOT OPEN'!$A$8:$P$200,11)","v":"9 + 6 × (-10)"},{"$f":"VLOOKUP($F12,'System DO NOT OPEN'!$A$8:$P$200,16)","v":"-51"}]
[{"$f":"Worksheet!D15","v":"Medium"},45,{"$f":"IF(COUNTIF(B$1:B13,B13)<>1,IF($A13=\"Easier\",RANDBETWEEN(1,Easy),IF($A13=\"Medium\",RANDBETWEEN(Easy+1,Easy+Medium),IF($A13=\"Harder\",RANDBETWEEN(Easy+Medium+1,Easy+Medium+Hard),RANDBETWEEN(1,Easy+Medium+Hard)))),B13)","v":44},{"$f":"IF(COUNTIF(C$1:C13,C13)<>1,IF($A13=\"Easier\",RANDBETWEEN(1,Easy),IF($A13=\"Medium\",RANDBETWEEN(Easy+1,Easy+Medium),IF($A13=\"Harder\",RANDBETWEEN(Easy+Medium+1,Easy+Medium+Hard),RANDBETWEEN(1,Easy+Medium+Hard)))),C13)","v":37},{"$f":"IF(COUNTIF(D$1:D13,D13)<>1,IF($A13=\"Easier\",RANDBETWEEN(1,Easy),IF($A13=\"Medium\",RANDBETWEEN(Easy+1,Easy+Medium),IF($A13=\"Harder\",RANDBETWEEN(Easy+Medium+1,Easy+Medium+Hard),RANDBETWEEN(1,Easy+Medium+Hard)))),D13)","v":37},{"$f":"IF(COUNTIF(E$1:E13,E13)<>1,IF($A13=\"Easier\",RANDBETWEEN(1,Easy),IF($A13=\"Medium\",RANDBETWEEN(Easy+1,Easy+Medium),IF($A13=\"Harder\",RANDBETWEEN(Easy+Medium+1,Easy+Medium+Hard),RANDBETWEEN(1,Easy+Medium+Hard)))),E13)","v":37},13,{"$f":"VLOOKUP($F13,'System DO NOT OPEN'!$A$8:$P$200,11)","v":"Divide:           180 ÷ 40"},{"$f":"VLOOKUP($F13,'System DO NOT OPEN'!$A$8:$P$200,16)","v":"4.5"}]
[{"$f":"Worksheet!D16","v":"Medium"},39,{"$f":"IF(COUNTIF(B$1:B14,B14)<>1,IF($A14=\"Easier\",RANDBETWEEN(1,Easy),IF($A14=\"Medium\",RANDBETWEEN(Easy+1,Easy+Medium),IF($A14=\"Harder\",RANDBETWEEN(Easy+Medium+1,Easy+Medium+Hard),RANDBETWEEN(1,Easy+Medium+Hard)))),B14)","v":39},{"$f":"IF(COUNTIF(C$1:C14,C14)<>1,IF($A14=\"Easier\",RANDBETWEEN(1,Easy),IF($A14=\"Medium\",RANDBETWEEN(Easy+1,Easy+Medium),IF($A14=\"Harder\",RANDBETWEEN(Easy+Medium+1,Easy+Medium+Hard),RANDBETWEEN(1,Easy+Medium+Hard)))),C14)","v":39},{"$f":"IF(COUNTIF(D$1:D14,D14)<>1,IF($A14=\"Easier\",RANDBETWEEN(1,Easy),IF($A14=\"Medium\",RANDBETWEEN(Easy+1,Easy+Medium),IF($A14=\"Harder\",RANDBETWEEN(Easy+Medium+1,Easy+Medium+Hard),RANDBETWEEN(1,Easy+Medium+Hard)))),D14)","v":39},{"$f":"IF(COUNTIF(E$1:E14,E14)<>1,IF($A14=\"Easier\",RANDBETWEEN(1,Easy),IF($A14=\"Medium\",RANDBETWEEN(Easy+1,Easy+Medium),IF($A14=\"Harder\",RANDBETWEEN(Easy+Medium+1,Easy+Medium+Hard),RANDBETWEEN(1,Easy+Medium+Hard)))),E14)","v":39},14,{"$f":"VLOOKUP($F14,'System DO NOT OPEN'!$A$8:$P$200,11)","v":"Divide:           -8000 ÷ 50"},{"$f":"VLOOKUP($F14,'System DO NOT OPEN'!$A$8:$P$200,16)","v":"80"}]
[{"$f":"Worksheet!D17","v":"Harder"},57,{"$f":"IF(COUNTIF(B$1:B15,B15)<>1,IF($A15=\"Easier\",RANDBETWEEN(1,Easy),IF($A15=\"Medium\",RANDBETWEEN(Easy+1,Easy+Medium),IF($A15=\"Harder\",RANDBETWEEN(Easy+Medium+1,Easy+Medium+Hard),RANDBETWEEN(1,Easy+Medium+Hard)))),B15)","v":57},{"$f":"IF(COUNTIF(C$1:C15,C15)<>1,IF($A15=\"Easier\",RANDBETWEEN(1,Easy),IF($A15=\"Medium\",RANDBETWEEN(Easy+1,Easy+Medium),IF($A15=\"Harder\",RANDBETWEEN(Easy+Medium+1,Easy+Medium+Hard),RANDBETWEEN(1,Easy+Medium+Hard)))),C15)","v":57},{"$f":"IF(COUNTIF(D$1:D15,D15)<>1,IF($A15=\"Easier\",RANDBETWEEN(1,Easy),IF($A15=\"Medium\",RANDBETWEEN(Easy+1,Easy+Medium),IF($A15=\"Harder\",RANDBETWEEN(Easy+Medium+1,Easy+Medium+Hard),RANDBETWEEN(1,Easy+Medium+Hard)))),D15)","v":57},{"$f":"IF(COUNTIF(E$1:E15,E15)<>1,IF($A15=\"Easier\",RANDBETWEEN(1,Easy),IF($A15=\"Medium\",RANDBETWEEN(Easy+1,Easy+Medium),IF($A15=\"Harder\",RANDBETWEEN(Easy+Medium+1,Easy+Medium+Hard),RANDBETWEEN(1,Easy+Medium+Hard)))),E15)","v":57},15,{"$f":"VLOOKUP($F15,'System DO NOT OPEN'!$A$8:$P$200,11)","v":"0.9 × 3300"},{"$f":"VLOOKUP($F15,'System DO NOT OPEN'!$A$8:$P$200,16)","v":"2970"}]
{"$rows_left_out":6}
{"sheet":"System DO NOT OPEN","index":2,"n_rows":110,"n_cols":17,"rows_kept":110,"cut":false,"hidden":false,"merged":[]}
["Must be sorted by column B"]
["Number of easy questions",{"$f":"COUNTIF(ABC,\"A\")","v":28},null,null,null,null,"A = basic"]
["Number of medium questions",{"$f":"COUNTIF(ABC,\"B\")","v":21},null,null,null,null,"B = routine"]
["Number of hard questions",{"$f":"COUNTIF(ABC,\"C\")","v":9},null,null,null,null,"C = A/B"]
["TOTAL",{"$f":"COUNT(Numbers)","v":58}]
[null,{"$f":"B2+B3+B4=B5","v":true}]
["Question number","Difficulty",null,null,null,null,null,null,null,null,null,null,null,null,null,"Answer","# occurences"]
[{"$f":"IF(ISBLANK(C8),\" \",ROW(B8)-7)","v":1},"A","Take away:     ",{"$f":"RANDBETWEEN(4,9)+RANDBETWEEN(0,9)/10+RANDBETWEEN(1,9)/100","v":7.7700000000000005}," – ",{"$f":"RANDBETWEEN(1,3)+RANDBETWEEN(1,9)/10","v":2.6},null,null,null,null,{"$f":"CONCATENATE(\"\",C8,\"\",D8,\"\",E8,\"\",F8,\"\",G8,\"\",H8,\"\",I8,\"\",J8,\"\")","v":"Take away:     7.77 – 2.6"},{"$f":"D8-F8","v":5.17},null,null,null,{"$f":"CONCATENATE(\"\",L8,\"\",M8,\"\",N8,\"\",O8,\"\")","v":"5.17"},4]
[2,"A","Add:           ",{"$f":"RANDBETWEEN(2,9)+RANDBETWEEN(0,9)/10+RANDBETWEEN(1,9)/100","v":6.17}," + ",{"$f":"RANDBETWEEN(11,29)+RANDBETWEEN(1,9)/10","v":18.2},null,null,null,null,"Add:           6.17 + 18.2",{"$f":"D9+F9","v":24.369999999999997},null,null,null,"24.37",3]
[3,"A","Multiply:           ",{"$f":"RANDBETWEEN(2,9)+RANDBETWEEN(0,9)/10+RANDBETWEEN(1,9)/100","v":3.18}," × ",{"$f":"RANDBETWEEN(6,9)","v":9},null,null,null,null,"Multiply:           3.18 × 9",{"$f":"D10*F10","v":28.62},null,null,null,"28.62",3]
[4,"A","Divide:           ",{"$f":"(RANDBETWEEN(2,9)+RANDBETWEEN(0,9)/10+RANDBETWEEN(1,9)/100)*F11","v":36.18}," ÷ ",{"$f":"RANDBETWEEN(6,9)","v":6},null,null,null,null,"Divide:           36.18 ÷ 6",{"$f":"D11/F11","v":6.03},null,null,null,"6.03",4]
[5,"A","Take away:     ",{"$f":"RANDBETWEEN(2,19)","v":19}," –  (",{"$f":"RANDBETWEEN(-15,-1)","v":-10},")",null,null,null,"Take away:     19 –  (-10)",{"$f":"D12-F12","v":29},null,null,null,"29",5]
[6,"A","Multiply:           ",{"$f":"RANDBETWEEN(2,10)","v":6}," × (",{"$f":"RANDBETWEEN(-10,-3)","v":-8},")",null,null,null,"Multiply:           6 × (-8)",{"$f":"D13*F13","v":-48},null,null,null,"-48"]
[7,"A","Multiply:           (",{"$f":"RANDBETWEEN(-9,-3)","v":-3},") × (",{"$f":"RANDBETWEEN(-10,-3)","v":-6},")",null,null,null,"Multiply:           (-3) × (-6)",{"$f":"D14*F14","v":18},null,null,null,"18",1]
[8,"A","Add:           ",{"$f":"RANDBETWEEN(2,20)","v":16}," +  (",{"$f":"RANDBETWEEN(-30,-1*D15)","v":-24},")",null,null,null,"Add:           16 +  (-24)",{"$f":"D15+F15","v":-8},null,null,null,"-8",2]
{"$rows_left_out":95}