{"text_format":"1","workbook":"xlsx","n_sheets":2,"sheets":["Worksheet","SYSTEM FORMULAE"],"not_rendered":{"charts":0,"images":0,"macros":1,"external_links":0,"defined_names":3,"comments":0,"pivot_tables":0},"unopened":[],"bounds":{"document_bytes":16777216,"sheet_cells":100000,"rows_first":2000,"rows_last":500,"rows_between":2000,"halvings":0,"cell_chars":16384,"cell_head_chars":4096},"cells_cut":0,"cells_raw":0,"read":"whole","date_system":"1900"}

{"sheet":"Worksheet","index":0,"n_rows":28,"n_cols":20,"rows_kept":28,"cut":false,"hidden":false,"merged":[[0,4,0,18],[1,11,1,15],[1,8,1,10],[1,0,1,3],[5,0,5,3],[6,0,6,2],[2,0,2,2],[1,16,1,18],[10,0,10,3],[3,0,3,3],[4,0,4,2],[8,0,8,2],[9,0,9,2],[7,0,7,2]]}
[null,null,null,null,"How do you write these lengths with a decimal point?"]
["Variables",null,null,null,null,null,null,null,"Whole number",null,null,"Mixed units",null,null,null,null,"with Decimal point"]
["SHOW ANSWERS",null,null,false,1,65,"Molly ","high jump","106","cm","=",1,"m",6.0000000000000053,"cm","=","1.06","m","",3]
["Numbers",null,null,null,2,3,"Lydia ","long jump","564","cm","=",5,"m",63.999999999999972,"cm","=","5.64","m","",3]
["Maximum whole number in mixed units",null,null,5,3,26,"Christopher ","long jump","434","cm","=",4,"m",33.999999999999986,"cm","=","4.34","m","",3]
["Which columns are visible",null,null,null,4,51,"Louise ","high jump","408","cm","=",4,"m",8.0000000000000071,"cm","=","4.08","m","",3]
["A mixture",null,null,3,5,36,"Connor ","long jump","298","cm","=",2,"m",98,"cm","=","2.98","m","",3]
["First column",null,null,null,6,2,"Connor ","long jump","504","cm","=",5,"m",4.0000000000000036,"cm","=","5.04","m","",3]
["Middle column",null,null,null,7,8,"Patrick ","high jump","580","cm","=",5,"m",79.999999999999986,"cm","=","5.8","m","(or 5.80 m)",3]
["Final column",null,null,null,8,59,"Harriet ","shot putt","115","cm","=",1,"m",14.999999999999991,"cm","=","1.15","m","",3]
{"$rows_left_out":19}
{"sheet":"SYSTEM FORMULAE","index":1,"n_rows":200,"n_cols":36,"rows_kept":200,"cut":false,"hidden":false,"merged":[]}
[null,null,null,null,null,null,null,null,null,null,null,null,null,null,null,1,{"$f":"RANDBETWEEN(1,MAX('SYSTEM FORMULAE'!$A$1:$A$161))","v":30},{"$f":"OFFSET($AJ$1,RANDBETWEEN(0,199),0)","v":"Amelia "},{"$f":"CHOOSE(RANDBETWEEN(1,3),\"long jump\",\"high jump\",\"shot putt\")","v":"shot putt"},{"$f":"IF(RIGHT(TEXT(VLOOKUP(Q1,'SYSTEM FORMULAE'!$A$1:$M$161,4),\"#,##0.###\"),1)=\".\",LEFT(TEXT(VLOOKUP(Q1,'SYSTEM FORMULAE'!$A$1:$M$161,4),\"#,##0.###\"),LEN(TEXT(VLOOKUP(Q1,'SYSTEM FORMULAE'!$A$1:$M$161,4),\"#,##0.###\"))-1),TEXT(VLOOKUP(Q1,'SYSTEM FORMULAE'!$A$1:$M$161,4),\"#,##0.###\"))","v":"190"},{"$f":"VLOOKUP(Q1,'SYSTEM FORMULAE'!$A$1:$M$161,5)","v":"cm"},"=",{"$f":"VLOOKUP($Q1,'SYSTEM FORMULAE'!$A$1:$M$161,7)","v":1},{"$f":"VLOOKUP($Q1,'SYSTEM FORMULAE'!$A$1:$M$161,8)","v":"m"},{"$f":"VLOOKUP($Q1,'SYSTEM FORMULAE'!$A$1:$M$161,9)","v":89.999999999999986},{"$f":"VLOOKUP($Q1,'SYSTEM FORMULAE'!$A$1:$M$161,10)","v":"cm"},"=",{"$f":"IF(RIGHT(TEXT(VLOOKUP(Q1,'SYSTEM FORMULAE'!$A$1:$M$161,12),\"#,##0.###\"),1)=\".\",LEFT(TEXT(VLOOKUP(Q1,'SYSTEM FORMULAE'!$A$1:$M$161,12),\"#,##0.###\"),LEN(TEXT(VLOOKUP(Q1,'SYSTEM FORMULAE'!$A$1:$M$161,12),\"#,##0.###\"))-1),TEXT(VLOOKUP(Q1,'SYSTEM FORMULAE'!$A$1:$M$161,12),\"#,##0.###\"))","v":"1.9"},{"$f":"VLOOKUP(Q1,'SYSTEM FORMULAE'!$A$1:$M$161,13)","v":"m"},{"$f":"IF(AND(U1=\"cm\",NOT(AE1=4)),IF(INT(AB1*10)=(AB1*10),CONCATENATE(\"(or \",AB1,\"0\",\" m)\"),\"\"),IF(AND(U1=\"m\",NOT(AE1=4)),IF(INT(AB1*10)=(AB1*10),CONCATENATE(\"(or \",AB1,\"00\",\" km)\"),IF(INT(AB1*100)=(AB1*100),CONCATENATE(\"(or \",AB1,\"0\",\" km)\"),\"\")),\"\"))","v":"(or 1.90 m)"},{"$f":"IF(Worksheet!$D$7=1,RANDBETWEEN(3,4),Worksheet!$D$7)","v":3},null,null,null,null,"Jack "]
[{"$f":"IF(COUNTIF($B$1:B2,TRUE)=COUNTIF($B$1:B1,TRUE),\"\",COUNTIF($B$1:B2,TRUE))","v":1},{"$f":"Worksheet!$B$12","v":true},100,{"$f":"100*L2","v":409},"cm","=",{"$f":"INT(L2)","v":4},"m",{"$f":"IF((L2-INT(L2))*C2=0,0,(L2-INT(L2))*C2)","v":8.9999999999999858},"cm","=",{"$f":"RANDBETWEEN(1,Worksheet!$D$5)+CHOOSE(RANDBETWEEN(1,LOG10(C2)),RANDBETWEEN(1,9)/10^RANDBETWEEN(1,LOG10(C2)),RANDBETWEEN(1,99)/10^RANDBETWEEN(2,LOG10(C2)),RANDBETWEEN(0,999)/10^RANDBETWEEN(3,LOG10(C2)),RANDBETWEEN(0,9999)/C2)","v":4.09},"m",null,null,{"$f":"P1+1","v":2},{"$f":"RANDBETWEEN(1,MAX('SYSTEM FORMULAE'!$A$1:$A$161))","v":77},{"$f":"OFFSET($AJ$1,RANDBETWEEN(0,199),0)","v":"Mohammad "},{"$f":"CHOOSE(RANDBETWEEN(1,3),\"long jump\",\"high jump\",\"shot putt\")","v":"high jump"},{"$f":"IF(RIGHT(TEXT(VLOOKUP(Q2,'SYSTEM FORMULAE'!$A$1:$M$161,4),\"#,##0.###\"),1)=\".\",LEFT(TEXT(VLOOKUP(Q2,'SYSTEM FORMULAE'!$A$1:$M$161,4),\"#,##0.###\"),LEN(TEXT(VLOOKUP(Q2,'SYSTEM FORMULAE'!$A$1:$M$161,4),\"#,##0.###\"))-1),TEXT(VLOOKUP(Q2,'SYSTEM FORMULAE'!$A$1:$M$161,4),\"#,##0.###\"))","v":"288"},{"$f":"VLOOKUP(Q2,'SYSTEM FORMULAE'!$A$1:$M$161,5)","v":"cm"},"=",{"$f":"VLOOKUP($Q2,'SYSTEM FORMULAE'!$A$1:$M$161,7)","v":2},{"$f":"VLOOKUP($Q2,'SYSTEM FORMULAE'!$A$1:$M$161,8)","v":"m"},{"$f":"VLOOKUP($Q2,'SYSTEM FORMULAE'!$A$1:$M$161,9)","v":87.999999999999986},{"$f":"VLOOKUP($Q2,'SYSTEM FORMULAE'!$A$1:$M$161,10)","v":"cm"},"=",{"$f":"IF(RIGHT(TEXT(VLOOKUP(Q2,'SYSTEM FORMULAE'!$A$1:$M$161,12),\"#,##0.###\"),1)=\".\",LEFT(TEXT(VLOOKUP(Q2,'SYSTEM FORMULAE'!$A$1:$M$161,12),\"#,##0.###\"),LEN(TEXT(VLOOKUP(Q2,'SYSTEM FORMULAE'!$A$1:$M$161,12),\"#,##0.###\"))-1),TEXT(VLOOKUP(Q2,'SYSTEM FORMULAE'!$A$1:$M$161,12),\"#,##0.###\"))","v":"2.88"},{"$f":"VLOOKUP(Q2,'SYSTEM FORMULAE'!$A$1:$M$161,13)","v":"m"},{"$f":"IF(AND(U2=\"cm\",NOT(AE2=4)),IF(INT(AB2*10)=(AB2*10),CONCATENATE(\"(or \",AB2,\"0\",\" m)\"),\"\"),IF(AND(U2=\"m\",NOT(AE2=4)),IF(INT(AB2*10)=(AB2*10),CONCATENATE(\"(or \",AB2,\"00\",\" km)\"),IF(INT(AB2*100)=(AB2*100),CONCATENATE(\"(or \",AB2,\"0\",\" km)\"),\"\")),\"\"))","v":""},{"$f":"IF(Worksheet!$D$7=1,RANDBETWEEN(3,4),Worksheet!$D$7)","v":3},null,null,null,null,"Thomas "]
[{"$f":"IF(COUNTIF($B$1:B3,TRUE)=COUNTIF($B$1:B2,TRUE),\"\",COUNTIF($B$1:B3,TRUE))","v":""},{"$f":"Worksheet!$D$12","v":false},1000,{"$f":"1000*L3","v":5054},"m","=",5,"km",54.00000000000027,"m","=",{"$f":"RANDBETWEEN(1,Worksheet!$D$5)+CHOOSE(RANDBETWEEN(1,LOG10(C3)),RANDBETWEEN(1,9)/10^RANDBETWEEN(1,LOG10(C3)),RANDBETWEEN(1,99)/10^RANDBETWEEN(2,LOG10(C3)),RANDBETWEEN(0,999)/10^RANDBETWEEN(3,LOG10(C3)),RANDBETWEEN(0,9999)/C3)","v":5.0540000000000003},"km",null,null,{"$f":"P2+1","v":3},{"$f":"RANDBETWEEN(1,MAX('SYSTEM FORMULAE'!$A$1:$A$161))","v":77},"Ross ","shot putt",{"$f":"IF(RIGHT(TEXT(VLOOKUP(Q3,'SYSTEM FORMULAE'!$A$1:$M$161,4),\"#,##0.###\"),1)=\".\",LEFT(TEXT(VLOOKUP(Q3,'SYSTEM FORMULAE'!$A$1:$M$161,4),\"#,##0.###\"),LEN(TEXT(VLOOKUP(Q3,'SYSTEM FORMULAE'!$A$1:$M$161,4),\"#,##0.###\"))-1),TEXT(VLOOKUP(Q3,'SYSTEM FORMULAE'!$A$1:$M$161,4),\"#,##0.###\"))","v":"288"},{"$f":"VLOOKUP(Q3,'SYSTEM FORMULAE'!$A$1:$M$161,5)","v":"cm"},"=",{"$f":"VLOOKUP($Q3,'SYSTEM FORMULAE'!$A$1:$M$161,7)","v":2},{"$f":"VLOOKUP($Q3,'SYSTEM FORMULAE'!$A$1:$M$161,8)","v":"m"},{"$f":"VLOOKUP($Q3,'SYSTEM FORMULAE'!$A$1:$M$161,9)","v":87.999999999999986},{"$f":"VLOOKUP($Q3,'SYSTEM FORMULAE'!$A$1:$M$161,10)","v":"cm"},"=",{"$f":"IF(RIGHT(TEXT(VLOOKUP(Q3,'SYSTEM FORMULAE'!$A$1:$M$161,12),\"#,##0.###\"),1)=\".\",LEFT(TEXT(VLOOKUP(Q3,'SYSTEM FORMULAE'!$A$1:$M$161,12),\"#,##0.###\"),LEN(TEXT(VLOOKUP(Q3,'SYSTEM FORMULAE'!$A$1:$M$161,12),\"#,##0.###\"))-1),TEXT(VLOOKUP(Q3,'SYSTEM FORMULAE'!$A$1:$M$161,12),\"#,##0.###\"))","v":"2.88"},{"$f":"VLOOKUP(Q3,'SYSTEM FORMULAE'!$A$1:$M$161,13)","v":"m"},"",{"$f":"IF(Worksheet!$D$7=1,RANDBETWEEN(3,4),Worksheet!$D$7)","v":3},null,null,null,null,"James "]
[{"$f":"IF(COUNTIF($B$1:B4,TRUE)=COUNTIF($B$1:B3,TRUE),\"\",COUNTIF($B$1:B4,TRUE))","v":2},{"$f":"Worksheet!$B$12","v":true},100,{"$f":"100*L4","v":208},"cm","=",{"$f":"INT(L4)","v":2},"m",{"$f":"IF((L4-INT(L4))*C4=0,0,(L4-INT(L4))*C4)","v":8.0000000000000071},"cm","=",{"$f":"RANDBETWEEN(1,Worksheet!$D$5)+CHOOSE(RANDBETWEEN(1,LOG10(C4)),RANDBETWEEN(1,9)/10^RANDBETWEEN(1,LOG10(C4)),RANDBETWEEN(1,99)/10^RANDBETWEEN(2,LOG10(C4)),RANDBETWEEN(0,999)/10^RANDBETWEEN(3,LOG10(C4)),RANDBETWEEN(0,9999)/C4)","v":2.08},"m",null,null,4,{"$f":"RANDBETWEEN(1,MAX('SYSTEM FORMULAE'!$A$1:$A$161))","v":25},"Jodie ","long jump",{"$f":"IF(RIGHT(TEXT(VLOOKUP(Q4,'SYSTEM FORMULAE'!$A$1:$M$161,4),\"#,##0.###\"),1)=\".\",LEFT(TEXT(VLOOKUP(Q4,'SYSTEM FORMULAE'!$A$1:$M$161,4),\"#,##0.###\"),LEN(TEXT(VLOOKUP(Q4,'SYSTEM FORMULAE'!$A$1:$M$161,4),\"#,##0.###\"))-1),TEXT(VLOOKUP(Q4,'SYSTEM FORMULAE'!$A$1:$M$161,4),\"#,##0.###\"))","v":"140"},{"$f":"VLOOKUP(Q4,'SYSTEM FORMULAE'!$A$1:$M$161,5)","v":"cm"},"=",{"$f":"VLOOKUP($Q4,'SYSTEM FORMULAE'!$A$1:$M$161,7)","v":1},{"$f":"VLOOKUP($Q4,'SYSTEM FORMULAE'!$A$1:$M$161,8)","v":"m"},{"$f":"VLOOKUP($Q4,'SYSTEM FORMULAE'!$A$1:$M$161,9)","v":39.999999999999993},{"$f":"VLOOKUP($Q4,'SYSTEM FORMULAE'!$A$1:$M$161,10)","v":"cm"},"=",{"$f":"IF(RIGHT(TEXT(VLOOKUP(Q4,'SYSTEM FORMULAE'!$A$1:$M$161,12),\"#,##0.###\"),1)=\".\",LEFT(TEXT(VLOOKUP(Q4,'SYSTEM FORMULAE'!$A$1:$M$161,12),\"#,##0.###\"),LEN(TEXT(VLOOKUP(Q4,'SYSTEM FORMULAE'!$A$1:$M$161,12),\"#,##0.###\"))-1),TEXT(VLOOKUP(Q4,'SYSTEM FORMULAE'!$A$1:$M$161,12),\"#,##0.###\"))","v":"1.4"},{"$f":"VLOOKUP(Q4,'SYSTEM FORMULAE'!$A$1:$M$161,13)","v":"m"},"(or 1.40 m)",{"$f":"IF(Worksheet!$D$7=1,RANDBETWEEN(3,4),Worksheet!$D$7)","v":3},null,null,null,null,"Daniel "]
[{"$f":"IF(COUNTIF($B$1:B5,TRUE)=COUNTIF($B$1:B4,TRUE),\"\",COUNTIF($B$1:B5,TRUE))","v":""},{"$f":"Worksheet!$D$12","v":false},1000,{"$f":"1000*L5","v":3617},"m","=",3,"km",617,"m","=",{"$f":"RANDBETWEEN(1,Worksheet!$D$5)+CHOOSE(RANDBETWEEN(1,LOG10(C5)),RANDBETWEEN(1,9)/10^RANDBETWEEN(1,LOG10(C5)),RANDBETWEEN(1,99)/10^RANDBETWEEN(2,LOG10(C5)),RANDBETWEEN(0,999)/10^RANDBETWEEN(3,LOG10(C5)),RANDBETWEEN(0,9999)/C5)","v":3.617},"km",null,null,5,{"$f":"RANDBETWEEN(1,MAX('SYSTEM FORMULAE'!$A$1:$A$161))","v":53},"Paige ","shot putt",{"$f":"IF(RIGHT(TEXT(VLOOKUP(Q5,'SYSTEM FORMULAE'!$A$1:$M$161,4),\"#,##0.###\"),1)=\".\",LEFT(TEXT(VLOOKUP(Q5,'SYSTEM FORMULAE'!$A$1:$M$161,4),\"#,##0.###\"),LEN(TEXT(VLOOKUP(Q5,'SYSTEM FORMULAE'!$A$1:$M$161,4),\"#,##0.###\"))-1),TEXT(VLOOKUP(Q5,'SYSTEM FORMULAE'!$A$1:$M$161,4),\"#,##0.###\"))","v":"270"},{"$f":"VLOOKUP(Q5,'SYSTEM FORMULAE'!$A$1:$M$161,5)","v":"cm"},"=",{"$f":"VLOOKUP($Q5,'SYSTEM FORMULAE'!$A$1:$M$161,7)","v":2},{"$f":"VLOOKUP($Q5,'SYSTEM FORMULAE'!$A$1:$M$161,8)","v":"m"},{"$f":"VLOOKUP($Q5,'SYSTEM FORMULAE'!$A$1:$M$161,9)","v":70.000000000000014},{"$f":"VLOOKUP($Q5,'SYSTEM FORMULAE'!$A$1:$M$161,10)","v":"cm"},"=",{"$f":"IF(RIGHT(TEXT(VLOOKUP(Q5,'SYSTEM FORMULAE'!$A$1:$M$161,12),\"#,##0.###\"),1)=\".\",LEFT(TEXT(VLOOKUP(Q5,'SYSTEM FORMULAE'!$A$1:$M$161,12),\"#,##0.###\"),LEN(TEXT(VLOOKUP(Q5,'SYSTEM FORMULAE'!$A$1:$M$161,12),\"#,##0.###\"))-1),TEXT(VLOOKUP(Q5,'SYSTEM FORMULAE'!$A$1:$M$161,12),\"#,##0.###\"))","v":"2.7"},{"$f":"VLOOKUP(Q5,'SYSTEM FORMULAE'!$A$1:$M$161,13)","v":"m"},"(or 2.70 m)",{"$f":"IF(Worksheet!$D$7=1,RANDBETWEEN(3,4),Worksheet!$D$7)","v":3},null,null,null,null,"Josh "]
[{"$f":"IF(COUNTIF($B$1:B6,TRUE)=COUNTIF($B$1:B5,TRUE),\"\",COUNTIF($B$1:B6,TRUE))","v":3},{"$f":"Worksheet!$B$12","v":true},100,{"$f":"100*L6","v":580},"cm","=",5,"m",79.999999999999986,"cm","=",{"$f":"RANDBETWEEN(1,Worksheet!$D$5)+CHOOSE(RANDBETWEEN(1,LOG10(C6)),RANDBETWEEN(1,9)/10^RANDBETWEEN(1,LOG10(C6)),RANDBETWEEN(1,99)/10^RANDBETWEEN(2,LOG10(C6)),RANDBETWEEN(0,999)/10^RANDBETWEEN(3,LOG10(C6)),RANDBETWEEN(0,9999)/C6)","v":5.8},"m",null,null,6,{"$f":"RANDBETWEEN(1,MAX('SYSTEM FORMULAE'!$A$1:$A$161))","v":37},"Madeleine ","high jump",{"$f":"IF(RIGHT(TEXT(VLOOKUP(Q6,'SYSTEM FORMULAE'!$A$1:$M$161,4),\"#,##0.###\"),1)=\".\",LEFT(TEXT(VLOOKUP(Q6,'SYSTEM FORMULAE'!$A$1:$M$161,4),\"#,##0.###\"),LEN(TEXT(VLOOKUP(Q6,'SYSTEM FORMULAE'!$A$1:$M$161,4),\"#,##0.###\"))-1),TEXT(VLOOKUP(Q6,'SYSTEM FORMULAE'!$A$1:$M$161,4),\"#,##0.###\"))","v":"537"},{"$f":"VLOOKUP(Q6,'SYSTEM FORMULAE'!$A$1:$M$161,5)","v":"cm"},"=",{"$f":"VLOOKUP($Q6,'SYSTEM FORMULAE'!$A$1:$M$161,7)","v":5},{"$f":"VLOOKUP($Q6,'SYSTEM FORMULAE'!$A$1:$M$161,8)","v":"m"},{"$f":"VLOOKUP($Q6,'SYSTEM FORMULAE'!$A$1:$M$161,9)","v":37.000000000000014},{"$f":"VLOOKUP($Q6,'SYSTEM FORMULAE'!$A$1:$M$161,10)","v":"cm"},"=",{"$f":"IF(RIGHT(TEXT(VLOOKUP(Q6,'SYSTEM FORMULAE'!$A$1:$M$161,12),\"#,##0.###\"),1)=\".\",LEFT(TEXT(VLOOKUP(Q6,'SYSTEM FORMULAE'!$A$1:$M$161,12),\"#,##0.###\"),LEN(TEXT(VLOOKUP(Q6,'SYSTEM FORMULAE'!$A$1:$M$161,12),\"#,##0.###\"))-1),TEXT(VLOOKUP(Q6,'SYSTEM FORMULAE'!$A$1:$M$161,12),\"#,##0.###\"))","v":"5.37"},{"$f":"VLOOKUP(Q6,'SYSTEM FORMULAE'!$A$1:$M$161,13)","v":"m"},"",{"$f":"IF(Worksheet!$D$7=1,RANDBETWEEN(3,4),Worksheet!$D$7)","v":3},null,null,null,null,"Matthew "]
[{"$f":"IF(COUNTIF($B$1:B7,TRUE)=COUNTIF($B$1:B6,TRUE),\"\",COUNTIF($B$1:B7,TRUE))","v":""},{"$f":"Worksheet!$D$12","v":false},1000,{"$f":"1000*L7","v":2073},"m","=",2,"km",72.999999999999957,"m","=",{"$f":"RANDBETWEEN(1,Worksheet!$D$5)+CHOOSE(RANDBETWEEN(1,LOG10(C7)),RANDBETWEEN(1,9)/10^RANDBETWEEN(1,LOG10(C7)),RANDBETWEEN(1,99)/10^RANDBETWEEN(2,LOG10(C7)),RANDBETWEEN(0,999)/10^RANDBETWEEN(3,LOG10(C7)),RANDBETWEEN(0,9999)/C7)","v":2.073},"km",null,null,7,{"$f":"RANDBETWEEN(1,MAX('SYSTEM FORMULAE'!$A$1:$A$161))","v":63},"Emily ","high jump",{"$f":"IF(RIGHT(TEXT(VLOOKUP(Q7,'SYSTEM FORMULAE'!$A$1:$M$161,4),\"#,##0.###\"),1)=\".\",LEFT(TEXT(VLOOKUP(Q7,'SYSTEM FORMULAE'!$A$1:$M$161,4),\"#,##0.###\"),LEN(TEXT(VLOOKUP(Q7,'SYSTEM FORMULAE'!$A$1:$M$161,4),\"#,##0.###\"))-1),TEXT(VLOOKUP(Q7,'SYSTEM FORMULAE'!$A$1:$M$161,4),\"#,##0.###\"))","v":"397"},{"$f":"VLOOKUP(Q7,'SYSTEM FORMULAE'!$A$1:$M$161,5)","v":"cm"},"=",{"$f":"VLOOKUP($Q7,'SYSTEM FORMULAE'!$A$1:$M$161,7)","v":3},{"$f":"VLOOKUP($Q7,'SYSTEM FORMULAE'!$A$1:$M$161,8)","v":"m"},{"$f":"VLOOKUP($Q7,'SYSTEM FORMULAE'!$A$1:$M$161,9)","v":96.999999999999972},{"$f":"VLOOKUP($Q7,'SYSTEM FORMULAE'!$A$1:$M$161,10)","v":"cm"},"=",{"$f":"IF(RIGHT(TEXT(VLOOKUP(Q7,'SYSTEM FORMULAE'!$A$1:$M$161,12),\"#,##0.###\"),1)=\".\",LEFT(TEXT(VLOOKUP(Q7,'SYSTEM FORMULAE'!$A$1:$M$161,12),\"#,##0.###\"),LEN(TEXT(VLOOKUP(Q7,'SYSTEM FORMULAE'!$A$1:$M$161,12),\"#,##0.###\"))-1),TEXT(VLOOKUP(Q7,'SYSTEM FORMULAE'!$A$1:$M$161,12),\"#,##0.###\"))","v":"3.97"},{"$f":"VLOOKUP(Q7,'SYSTEM FORMULAE'!$A$1:$M$161,13)","v":"m"},"",{"$f":"IF(Worksheet!$D$7=1,RANDBETWEEN(3,4),Worksheet!$D$7)","v":3},null,null,null,null,"Samuel "]
[{"$f":"IF(COUNTIF($B$1:B8,TRUE)=COUNTIF($B$1:B7,TRUE),\"\",COUNTIF($B$1:B8,TRUE))","v":4},{"$f":"Worksheet!$B$12","v":true},100,{"$f":"100*L8","v":409},"cm","=",4,"m",8.9999999999999858,"cm","=",{"$f":"RANDBETWEEN(1,Worksheet!$D$5)+CHOOSE(RANDBETWEEN(1,LOG10(C8)),RANDBETWEEN(1,9)/10^RANDBETWEEN(1,LOG10(C8)),RANDBETWEEN(1,99)/10^RANDBETWEEN(2,LOG10(C8)),RANDBETWEEN(0,999)/10^RANDBETWEEN(3,LOG10(C8)),RANDBETWEEN(0,9999)/C8)","v":4.09},"m",null,null,8,{"$f":"RANDBETWEEN(1,MAX('SYSTEM FORMULAE'!$A$1:$A$161))","v":34},"Jacob ","shot putt",{"$f":"IF(RIGHT(TEXT(VLOOKUP(Q8,'SYSTEM FORMULAE'!$A$1:$M$161,4),\"#,##0.###\"),1)=\".\",LEFT(TEXT(VLOOKUP(Q8,'SYSTEM FORMULAE'!$A$1:$M$161,4),\"#,##0.###\"),LEN(TEXT(VLOOKUP(Q8,'SYSTEM FORMULAE'!$A$1:$M$161,4),\"#,##0.###\"))-1),TEXT(VLOOKUP(Q8,'SYSTEM FORMULAE'!$A$1:$M$161,4),\"#,##0.###\"))","v":"201"},{"$f":"VLOOKUP(Q8,'SYSTEM FORMULAE'!$A$1:$M$161,5)","v":"cm"},"=",{"$f":"VLOOKUP($Q8,'SYSTEM FORMULAE'!$A$1:$M$161,7)","v":2},{"$f":"VLOOKUP($Q8,'SYSTEM FORMULAE'!$A$1:$M$161,8)","v":"m"},{"$f":"VLOOKUP($Q8,'SYSTEM FORMULAE'!$A$1:$M$161,9)","v":0.99999999999997868},{"$f":"VLOOKUP($Q8,'SYSTEM FORMULAE'!$A$1:$M$161,10)","v":"cm"},"=",{"$f":"IF(RIGHT(TEXT(VLOOKUP(Q8,'SYSTEM FORMULAE'!$A$1:$M$161,12),\"#,##0.###\"),1)=\".\",LEFT(TEXT(VLOOKUP(Q8,'SYSTEM FORMULAE'!$A$1:$M$161,12),\"#,##0.###\"),LEN(TEXT(VLOOKUP(Q8,'SYSTEM FORMULAE'!$A$1:$M$161,12),\"#,##0.###\"))-1),TEXT(VLOOKUP(Q8,'SYSTEM FORMULAE'!$A$1:$M$161,12),\"#,##0.###\"))","v":"2.01"},{"$f":"VLOOKUP(Q8,'SYSTEM FORMULAE'!$A$1:$M$161,13)","v":"m"},"",{"$f":"IF(Worksheet!$D$7=1,RANDBETWEEN(3,4),Worksheet!$D$7)","v":3},null,null,null,null,"Callum "]
[{"$f":"IF(COUNTIF($B$1:B9,TRUE)=COUNTIF($B$1:B8,TRUE),\"\",COUNTIF($B$1:B9,TRUE))","v":""},{"$f":"Worksheet!$D$12","v":false},1000,{"$f":"1000*L9","v":4490},"m","=",4,"km",490.00000000000023,"m","=",{"$f":"RANDBETWEEN(1,Worksheet!$D$5)+CHOOSE(RANDBETWEEN(1,LOG10(C9)),RANDBETWEEN(1,9)/10^RANDBETWEEN(1,LOG10(C9)),RANDBETWEEN(1,99)/10^RANDBETWEEN(2,LOG10(C9)),RANDBETWEEN(0,999)/10^RANDBETWEEN(3,LOG10(C9)),RANDBETWEEN(0,9999)/C9)","v":4.49},"km",null,null,9,{"$f":"RANDBETWEEN(1,MAX('SYSTEM FORMULAE'!$A$1:$A$161))","v":64},"Kieran ","long jump",{"$f":"IF(RIGHT(TEXT(VLOOKUP(Q9,'SYSTEM FORMULAE'!$A$1:$M$161,4),\"#,##0.###\"),1)=\".\",LEFT(TEXT(VLOOKUP(Q9,'SYSTEM FORMULAE'!$A$1:$M$161,4),\"#,##0.###\"),LEN(TEXT(VLOOKUP(Q9,'SYSTEM FORMULAE'!$A$1:$M$161,4),\"#,##0.###\"))-1),TEXT(VLOOKUP(Q9,'SYSTEM FORMULAE'!$A$1:$M$161,4),\"#,##0.###\"))","v":"277"},{"$f":"VLOOKUP(Q9,'SYSTEM FORMULAE'!$A$1:$M$161,5)","v":"cm"},"=",{"$f":"VLOOKUP($Q9,'SYSTEM FORMULAE'!$A$1:$M$161,7)","v":2},{"$f":"VLOOKUP($Q9,'SYSTEM FORMULAE'!$A$1:$M$161,8)","v":"m"},{"$f":"VLOOKUP($Q9,'SYSTEM FORMULAE'!$A$1:$M$161,9)","v":77},{"$f":"VLOOKUP($Q9,'SYSTEM FORMULAE'!$A$1:$M$161,10)","v":"cm"},"=",{"$f":"IF(RIGHT(TEXT(VLOOKUP(Q9,'SYSTEM FORMULAE'!$A$1:$M$161,12),\"#,##0.###\"),1)=\".\",LEFT(TEXT(VLOOKUP(Q9,'SYSTEM FORMULAE'!$A$1:$M$161,12),\"#,##0.###\"),LEN(TEXT(VLOOKUP(Q9,'SYSTEM FORMULAE'!$A$1:$M$161,12),\"#,##0.###\"))-1),TEXT(VLOOKUP(Q9,'SYSTEM FORMULAE'!$A$1:$M$161,12),\"#,##0.###\"))","v":"2.77"},{"$f":"VLOOKUP(Q9,'SYSTEM FORMULAE'!$A$1:$M$161,13)","v":"m"},"",{"$f":"IF(Worksheet!$D$7=1,RANDBETWEEN(3,4),Worksheet!$D$7)","v":3},null,null,null,null,"Joseph "]
[{"$f":"IF(COUNTIF($B$1:B10,TRUE)=COUNTIF($B$1:B9,TRUE),\"\",COUNTIF($B$1:B10,TRUE))","v":5},{"$f":"Worksheet!$B$12","v":true},100,{"$f":"100*L10","v":409.99999999999994},"cm","=",4,"m",9.9999999999999645,"cm","=",{"$f":"RANDBETWEEN(1,Worksheet!$D$5)+CHOOSE(RANDBETWEEN(1,LOG10(C10)),RANDBETWEEN(1,9)/10^RANDBETWEEN(1,LOG10(C10)),RANDBETWEEN(1,99)/10^RANDBETWEEN(2,LOG10(C10)),RANDBETWEEN(0,999)/10^RANDBETWEEN(3,LOG10(C10)),RANDBETWEEN(0,9999)/C10)","v":4.0999999999999996},"m",null,null,10,{"$f":"RANDBETWEEN(1,MAX('SYSTEM FORMULAE'!$A$1:$A$161))","v":27},"Isaac ","high jump",{"$f":"IF(RIGHT(TEXT(VLOOKUP(Q10,'SYSTEM FORMULAE'!$A$1:$M$161,4),\"#,##0.###\"),1)=\".\",LEFT(TEXT(VLOOKUP(Q10,'SYSTEM FORMULAE'!$A$1:$M$161,4),\"#,##0.###\"),LEN(TEXT(VLOOKUP(Q10,'SYSTEM FORMULAE'!$A$1:$M$161,4),\"#,##0.###\"))-1),TEXT(VLOOKUP(Q10,'SYSTEM FORMULAE'!$A$1:$M$161,4),\"#,##0.###\"))","v":"107"},{"$f":"VLOOKUP(Q10,'SYSTEM FORMULAE'!$A$1:$M$161,5)","v":"cm"},"=",{"$f":"VLOOKUP($Q10,'SYSTEM FORMULAE'!$A$1:$M$161,7)","v":1},{"$f":"VLOOKUP($Q10,'SYSTEM FORMULAE'!$A$1:$M$161,8)","v":"m"},{"$f":"VLOOKUP($Q10,'SYSTEM FORMULAE'!$A$1:$M$161,9)","v":7.0000000000000062},{"$f":"VLOOKUP($Q10,'SYSTEM FORMULAE'!$A$1:$M$161,10)","v":"cm"},"=",{"$f":"IF(RIGHT(TEXT(VLOOKUP(Q10,'SYSTEM FORMULAE'!$A$1:$M$161,12),\"#,##0.###\"),1)=\".\",LEFT(TEXT(VLOOKUP(Q10,'SYSTEM FORMULAE'!$A$1:$M$161,12),\"#,##0.###\"),LEN(TEXT(VLOOKUP(Q10,'SYSTEM FORMULAE'!$A$1:$M$161,12),\"#,##0.###\"))-1),TEXT(VLOOKUP(Q10,'SYSTEM FORMULAE'!$A$1:$M$161,12),\"#,##0.###\"))","v":"1.07"},{"$f":"VLOOKUP(Q10,'SYSTEM FORMULAE'!$A$1:$M$161,13)","v":"m"},"",{"$f":"IF(Worksheet!$D$7=1,RANDBETWEEN(3,4),Worksheet!$D$7)","v":3},null,null,null,null,"Jordan "]
{"$rows_left_out":190}